{"text_format":"1","workbook":"xlsx","n_sheets":7,"sheets":["Definicion","CodigoPostal","NoEditar","Catalogos","Trabajadores","Plantilla","Plantilla (Original)"],"not_rendered":{"charts":0,"images":1,"macros":1,"external_links":0,"defined_names":48,"comments":0,"pivot_tables":0},"unopened":[],"bounds":{"document_bytes":16777216,"sheet_cells":100000,"rows_first":2000,"rows_last":500,"rows_between":2000,"halvings":0,"cell_chars":16384,"cell_head_chars":4096},"cells_cut":0,"cells_raw":0,"read":"whole","date_system":"1900"}

{"sheet":"Definicion","index":0,"n_rows":68,"n_cols":8,"rows_kept":68,"cut":false,"hidden":false,"merged":[]}
["Nº CAMPO","NOMBRE","TIPO","LONGITUD MÁXIMA","OBLIGATORIO","VALORES ACEPTADOS","FORMATO PARA SALIDA"]
[1,"RFC","ALFANUMERICO",13,"SI",null,null,"EMISOR"]
[2,"CURP","ALFANUMERICO",18,"CONDICIONAL"]
[3,"REGISTRO PATRONAL","ALFANUMERICO",20,"CONDICIONAL"]
[4,"RÉGIMEN FISCAL","NUMERICO",3,"SI"]
[5,"CÓDIGO POSTAL","NUMERICO",5,"SI"]
[6,"FOLIO","NUMERICO",6,"SI",null,null,"NOMINA"]
[7,"VERSION","ALFANUMERICO",3,"SI"]
[8,"CÓDIGO TIPO NÓMINA","ALFANUMERICO",1,"SI"]
[9,"FECHA DE PAGO","FECHA",10,"SI","AAAA-MM-DD"]
[10,"FECHA INICIAL PERIODO DE NÓMINA","FECHA",10,"SI","AAAA-MM-DD"]
[11,"FECHA FINAL PERIODO DE NÓMINA","FECHA",10,"SI","AAAA-MM-DD"]
[12,"NÚMERO DE DÍAS PAGADOS","NUMERICO",3,"SI"]
[13,"NÚMERO DE NÓMINA","NUMERICO",2,"SI"]
[14,"RECEPTOR RFC","ALFANUMERICO",13,"SI",null,null,"RECEPTOR"]
[15,"RECEPTOR NOMBRE","ALFANUMERICO",72,"SI"]
[16,"RECEPTOR CURP","ALFANUMERICO",18,"SI"]
[17,"NÚMERO SEGURIDAD SOCIAL","ALFANUMERICO",15,"CONDICIONAL"]
[18,"RECEPTOR CÓDIGO POSTAL","NUMERICO",5,"SI"]
[19,"FECHA INICIO RELACIÓN LABORAL","FECHA",10,"CONDICIONAL","AAAA-MM-DD"]
[20,"ANTIGÜEDAD","NUMERICO",3,"CONDICIONAL"]
[21,"CÓDIGO TIPO DE CONTRATO","NUMERICO",2,"SI"]
[22,"SINDICALIZADO","ALFANUMERICO",2,"CONDICIONAL"]
[23,"CÓDIGO TIPO DE JORNADA","NUMERICO",2,"CONDICIONAL"]
[24,"CÓDIGO TIPO DE RÉGIMEN","NUMERICO",2,"SI"]
[25,"NÚMERO EMPLEADO","ALFANUMERICO",15,"SI"]
[26,"DEPARTAMENTO","ALFANUMERICO",100,"NO"]
[27,"PUESTO","ALFANUMERICO",100,"NO"]
[28,"CÓDIGO RIESGO PUESTO","NUMERICO",1,"CONDICIONAL"]
[29,"CÓDIGO PERIODICIDAD DEL PAGO","NUMERICO",2,"SI"]
[30,"CÓDIGO BANCO","NUMERICO",3,"CONDICIONAL"]
[31,"CUENTA BANCARIA","NUMERICO",18,"CONDICIONAL"]
[32,"SALARIO BASE","NUMERICO","9 Ent, 2 Dec","CONDICIONAL",null,"9,2"]
[33,"SALARIO DIARIO INTEGRADO","NUMERICO","9 Ent, 2 Dec","CONDICIONAL",null,"9,2"]
[34,"CÓDIGO ENTIDAD FEDERATIVA","ALFANUMERICO",3,"SI"]
[35,"MAIL 1","ALFANUMERICO",null,"SI"]
[36,"MAIL 2","ALFANUMERICO",null,"NO"]
[37,"RFC DE QUIEN SUBCONTRATA","ALFANUMERICO",18,"CONDICIONAL",null,null,"SUBCONTRATACION (OCURRE 5 VECES)"]
[38,"PORCENTAJE DEL TIEMPO QUE PRESTÓ SUS SERVICIOS","NUMERICO","3 Ent, 3 Dec","CONDICIONAL",null,"9,3"]
[39,"PERCEPCIÓN CÓDIGO SAT","NUMERICO",3,"NO",null,null,"PERCEPCIONES (OCURRE 12 VECES)"]
[40,"PERCEPCIÓN CÓDIGO INTERNO","NUMERICO",3,"NO"]
[41,"PERCEPCIÓN CONCEPTO","ALFANUMERICO",100,"NO"]
[42,"PERCEPCIÓN IMPORTE GRAVADO","NUMERICO","9 Ent, 2 Dec","NO",null,"9,2"]
[43,"PERCEPCIÓN IMPORTE EXCENTO","NUMERICO","9 Ent, 2 Dec","NO",null,"9,2"]
[44,"DEDUCCIÓN CÓDIGO SAT","NUMERICO",3,"NO",null,null,"DEDUCCIONES (OCURRE 12 VECES)"]
[45,"DEDUCCIÓN CÓDIGO INTERNO","NUMERICO",3,"NO"]
[46,"DEDUCCIÓN CONCEPTO","ALFANUMERICO",100,"NO"]
[47,"DEDUCCIÓN IMPORTE","NUMERICO","9 Ent, 2 Dec","NO",null,"9,2"]
[48,"OTRO PAGO CÓDIGO SAT","NUMERICO",3,"NO",null,null,"OTROS PAGOS (OCURRE 5 VECES)"]
[49,"OTRO PAGO CÓDIGO INTERNO","NUMERICO",3,"NO"]
[50,"OTRO PAGO CONCEPTO","ALFANUMERICO",100,"NO"]
[51,"OTRO PAGO IMPORTE","NUMERICO","9 Ent, 2 Dec","NO",null,"9,2"]
[52,"HORAS EXTRAS CÓDIGO INTERNO","NUMERICO",3,"NO",null,null,"TIEMPO EXTRA (OCURRE 2 VECES)"]
[53,"HORAS EXTRAS Nº DIAS","NUMERICO",3,"NO"]
[54,"HORAS EXTRAS CÓDIGO SAT","NUMERICO",2,"NO"]
[55,"HORAS EXTRAS Nº HORAS","NUMERICO",2,"NO"]
[56,"HORAS EXTRAS IMPORTE GRAVADO","NUMERICO","9 Ent, 2 Dec","NO",null,"9,2"]
[57,"HORAS EXTRAS IMPORTE EXCENTO","NUMERICO","9 Ent, 2 Dec","NO",null,"9,2"]
[58,"INCAPACIDAD CÓDIGO INTERNO","NUMERICO",3,"NO",null,null,"INCAPACIDADES (OCURRE 3 VECES)"]
[59,"INCAPACIDAD Nº DIAS","NUMERICO",3,"NO"]
[60,"INCAPACIDAD CÓDIGO SAT","NUMERICO",2,"NO"]
[61,"INCAPACIDAD IMPORTE","NUMERICO","9 Ent, 2 Dec","NO",null,"9,2"]
[62,"SEPARACION CÓDIGO INTERNO","NUMERICO",3,"NO",null,null,"SEPARACION INDEMNIZACION"]
[63,"SEPARACION TOTAL PAGADO","NUMERICO","9 Ent, 2 Dec","NO",null,"9,2"]
[64,"SEPARACION NÚMERO AÑOS DE SERVICIO","NUMERICO",2,"NO"]
[65,"SEPARACION ÚLTIMO SUELDO MENSUAL","NUMERICO","9 Ent, 2 Dec","NO",null,"9,2"]
[66,"SEPARACION INGRESO ACUMULABLE","NUMERICO","9 Ent, 2 Dec","NO",null,"9,2"]
[67,"SEPARACION INGRESO NO ACUMULABLE","NUMERICO","9 Ent, 2 Dec","NO",null,"9,2"]

{"sheet":"CodigoPostal","index":1,"n_rows":14,"n_cols":4,"rows_kept":14,"cut":false,"hidden":false,"merged":[[0,1,1,2]]}
[null,"GENERACIÓN DE ARCHIVOS TXT PARA VALIDACIÓN MASIVA DE CÓDIGOS POSTALES",null,"www.totalnot.mx"]
[null,null,null,"ventas@facturanot.com.mx"]
[]
[]
[]
["NOMBRE COMPLETO O DENOMINACIÓN",null,null,"RFC"]
["NOMBRE APELLIDO PATERNO APELLIDO MATERNO",null,null,"XAXX010101000"]
[]
["ENTIDAD FEDERATIVA"]
["mexico"]
[]
[]
[]
["VALIDA AQUÍ"]

{"sheet":"NoEditar","index":2,"n_rows":2405,"n_cols":34,"rows_kept":2405,"cut":false,"hidden":true,"merged":[]}
["aguascalientes",null,{"$f":"A1","v":"aguascalientes"},{"$f":"A2","v":"baja_california"},{"$f":"A3","v":"baja_california_sur"},{"$f":"A4","v":"campeche"},{"$f":"A5","v":"chiapas"},{"$f":"A6","v":"chihuahua"},{"$f":"A7","v":"coahuila"},{"$f":"A8","v":"colima"},{"$f":"A9","v":"ciudad_de_mexico"},{"$f":"A10","v":"durango"},{"$f":"A11","v":"guanajuato"},{"$f":"A12","v":"guerrero"},{"$f":"A13","v":"hidalgo"},{"$f":"A14","v":"jalisco"},{"$f":"A15","v":"mexico"},{"$f":"A16","v":"michoacan"},{"$f":"A17","v":"morelos"},{"$f":"A18","v":"nayarit"},{"$f":"A19","v":"nuevo_leon"},{"$f":"A20","v":"oaxaca"},{"$f":"A21","v":"puebla"},{"$f":"A22","v":"queretaro"},{"$f":"A23","v":"quintana_roo"},{"$f":"A24","v":"san_luis_potosi"},{"$f":"A25","v":"sinaloa"},{"$f":"A26","v":"sonora"},{"$f":"A27","v":"tabasco"},{"$f":"A28","v":"tamaulipas"},{"$f":"A29","v":"tlaxcala"},{"$f":"A30","v":"veracruz"},{"$f":"A31","v":"yucatan"},{"$f":"A32","v":"zacatecas"}]
["baja_california",null,20854,21000,23040,24334,29000,31000,25000,28800,8810,34000,36000,39000,42000,44100,50000,58000,62000,63890,64000,68000,72000,76000,77000,78000,80000,83000,86000,87000,90000,91000,97000,98000]
["baja_california_sur",null,20855,21010,23050,24335,29010,31020,25010,28807,8830,34010,36003,39010,42004,44110,50010,58004,62009,63893,64010,68010,72010,76010,77010,78037,80010,83010,86010,87010,90005,91010,97000,98010]
["campeche",null,20856,21020,23052,24336,29014,31029,25013,28808,8840,34014,36010,39012,42010,44130,50016,58006,62010,63894,64018,68013,72013,76017,77012,78038,80013,83013,86017,87014,90006,91013,97000,98015]
["chiapas",null,20860,21030,23054,24337,29016,31030,25014,28809,8900,34015,36013,39013,42014,44140,50017,58009,62017,63895,64019,68016,72014,76020,77013,78040,80014,83015,86018,87015,90010,91014,97000,98017]
["chihuahua",null,20862,21038,23055,24338,29017,31034,25015,28810,8910,34016,36014,39014,42015,44150,50018,58010,62018,63897,64020,68020,72015,76024,77014,78049,80015,83016,86019,87016,90013,91015,97000,98018]
["coahuila",null,20864,21039,23056,24342,29018,31050,25016,28812,8920,34017,36015,39015,42018,44158,50019,58013,62019,63899,64030,68023,72016,76025,77015,78100,80016,83020,86020,87018,90014,91016,97000,98019]
["colima",null,20870,21040,23060,24915,29019,31054,25017,28813,8930,34018,36016,39016,42020,44160,50020,58020,62020,63900,64040,68024,72017,76026,77016,78106,80017,83029,86025,87019,90019,91017,97000,98020]
["ciudad_de_mexico",null,20872,21050,23070,24916,29020,31060,25019,28814,9000,34019,36020,39017,42026,44170,50026,58030,62028,63904,64049,68025,72019,76027,77017,78107,80018,83030,86026,87020,90020,91018,97000,98023]
["durango",null,20874,21060,23075,24917,29023,31063,25020,28815,9010,34020,36023,39018,42027,44180,50040,58040,62323,63905,64050,68026,72020,76028,77018,78109,80019,83040,86027,87023,90030,91020,97000,98024]
["guanajuato",null,20880,21070,23076,24919,29024,31064,25022,28820,9020,34024,36024,39020,42029,44190,50050,58048,62324,63910,64060,68027,72023,76030,77019,78110,80020,83050,86029,87024,90040,91023,97003,98040]
["guerrero",null,20882,21079,23089,24920,29025,31065,25023,28826,9030,34027,36030,39022,42030,44200,50060,58049,62325,63911,64070,68028,72029,76036,77020,78115,80025,83060,86030,87025,90050,91024,97050,98045]
["hidalgo",null,20900,21080,23090,24925,29026,31066,25030,28830,9040,34028,36033,39025,42032,44210,50070,58050,62326,63913,64100,68030,72030,76037,77023,78116,80026,83067,86035,87026,90060,91025,97050,98046]
["jalisco",null,20901,21090,23094,24929,29027,31067,25034,28833,9060,34029,36040,39026,42033,44214,50071,58055,62328,63914,64102,68033,72040,76040,77024,78117,80027,83068,86037,87027,90062,91026,97059,98047]
["mexico",null,20903,21100,23095,24930,29028,31074,25036,28834,9070,34030,36043,39028,42034,44215,50075,58056,62329,63915,64103,68034,72044,76046,77025,78120,80028,83070,86038,87028,90080,91027,97060,98050]
["michoacan",null,20904,21110,23096,24933,29030,31075,25038,28836,9080,34034,36044,39029,42035,44216,50080,58057,62330,63920,64104,68039,72045,76047,77026,78130,80029,83078,86040,87029,90090,91028,97069,98053]
["morelos",null,20905,21120,23097,24934,29034,31076,25039,28838,9089,34038,36050,39030,42036,44217,50090,58058,62334,63923,64105,68040,72050,76048,77027,78133,80030,83079,86049,87030,90099,91030,97070,98054]
["nayarit",null,20916,21130,23098,24935,29037,31100,25040,28840,9090,34039,36053,39034,42037,44218,50100,58060,62335,63925,64106,68043,72060,76049,77028,78135,80034,83080,86050,87033,90100,91033,97070,98056]
["nuevo_leon",null,20917,21135,23099,24936,29038,31104,25043,28850,9099,34040,36060,39036,42039,44219,50103,58066,62340,63927,64107,68044,72062,76050,77029,78136,80040,83089,86059,87037,90102,91037,97070,98057]
["oaxaca",null,20920,21137,23300,24940,29039,31105,25045,28855,9100,34043,36080,39038,42040,44220,50110,58067,62343,63928,64108,68045,72070,76057,77030,78137,80050,83090,86060,87039,90105,91040,97080,98060]
["puebla",null,20922,21138,23302,24058,29040,31106,25047,28860,9130,34045,36086,39040,42050,44227,50115,58069,62345,63930,64109,68050,72072,76058,77034,78140,80054,83100,86067,87040,90110,91045,97088,98064]
["queretaro",null,20923,21139,23303,24060,29044,31107,25048,28863,9140,34046,36089,39043,42055,44230,50120,58070,62350,63935,64110,68060,72080,76059,77035,78143,80055,83103,86068,87043,90111,91046,97089,98065]
["quintana_roo",null,20924,21140,23304,24069,29045,31110,25049,28864,9180,34047,36090,39044,42056,44240,50122,58078,62360,63938,64116,68067,72089,76060,77036,78144,80058,83104,86069,87048,90112,91047,97098,98066]
["san_luis_potosi",null,20925,21147,23308,24070,29047,31114,25050,28450,9200,34048,36093,39047,42057,44246,50130,58080,62363,63940,64117,68068,72090,76063,77037,78146,80059,83105,86070,87049,90114,91048,97099,98067]
["sinaloa",null,20926,21150,23311,24073,29049,31115,25056,28452,9208,34049,36094,39048,42058,44247,50140,58085,62370,63944,64118,68070,72094,76067,77038,78147,80060,83106,86079,87050,90115,91049,97100,98068]
["sonora",null,20927,21160,23312,24075,29050,31116,25057,28454,9209,34050,36100,39050,42060,44249,50150,58086,62373,63945,64119,68075,72100,76069,77039,78148,80063,83107,86080,87058,90117,91050,97100,98070]
["tabasco",null,20928,21165,23317,24079,29053,31120,25060,28455,9210,34058,36110,39056,42064,44250,50160,58087,62374,63946,64120,68080,72103,76070,77040,78150,80064,83108,86087,87059,90118,91053,97100,98077]
["tamaulipas",null,20907,21170,23320,24080,29054,31122,25065,28456,9220,34060,36112,39058,42070,44257,50168,58088,62375,63947,64130,68083,72104,76074,77041,78153,80065,83110,86090,87060,90120,91054,97100,98078]
["tlaxcala",null,20908,21178,23322,24180,29055,31123,25067,28459,9230,34069,36113,39060,42075,44259,50170,58089,62376,63950,64140,68090,72105,76078,77048,78154,80070,83113,86095,87070,90121,91055,97107,98079]
["veracruz",null,20909,21179,23328,24185,29056,31124,25068,28460,9239,34070,36118,39068,42078,44260,50180,58090,62380,63953,64145,68100,72106,76079,77049,78165,80080,83114,86096,87071,90122,91056,97108,98080]
["yucatan",null,20910,21180,23329,24186,29057,31125,25069,28461,9240,34074,36119,39069,42079,44265,50190,58093,62382,63954,64148,68103,72108,76080,77050,78170,80088,83115,86097,87076,90123,91057,97109,98083]
["zacatecas",null,20913,21185,23330,24187,29058,31126,25070,28464,9250,34075,36120,39070,42080,44266,50200,58095,62384,63955,64150,68104,72110,76085,77053,78173,80090,83116,86098,87078,90124,91060,97109,98084]
[null,null,20914,21188,23333,24188,29059,31127,25075,28466,9260,34076,36122,39073,42082,44267,50205,58096,62385,63956,64157,68110,72114,76086,77059,78174,80093,83117,86099,87080,90125,91063,97110,98085]
[null,null,20915,21190,23334,24189,29060,31130,25076,28500,9270,34077,36125,39074,42083,44270,50206,58097,62387,63114,64158,68115,72115,76087,77060,78175,80100,83118,86100,87083,90126,91064,97113,98086]
[null,null,20237,21200,23350,24190,29064,31134,25077,28504,9280,34080,36126,39075,42084,44280,50209,58098,62556,63115,64159,68120,72116,76090,77070,78176,80103,83120,86107,87084,90127,91065,97113,98087]
[null,null,20238,21210,23354,24195,29065,31135,25080,28506,9290,34090,36127,39076,42086,44290,50210,58099,62560,63116,64160,68125,72120,76093,77079,78177,80104,83125,86108,87085,90128,91066,97113,98088]
[null,null,20239,21215,23360,24197,29066,31136,25083,28507,9300,34100,36129,39077,42088,44298,50214,58100,62563,63117,64165,68126,72124,76099,77080,78178,80105,83126,86109,87086,90130,91067,97114,98089]
[null,null,20240,21216,23361,24198,29067,31137,25084,28510,9310,34103,36130,39078,42090,44299,50220,58110,62564,63119,64167,68127,72127,76100,77082,78180,80106,83128,86120,87087,90131,91069,97114,98090]
[null,null,20247,21217,23362,24199,29070,31140,25085,28513,9319,34104,36132,39079,42092,44300,50223,58114,62565,63120,64168,68128,72130,76110,77083,78183,80107,83130,86125,87089,90132,91070,97115,98097]
[null,null,20248,21218,23363,24200,29073,31143,25086,28515,9320,34105,36133,39080,42094,44306,50225,58115,62566,63128,64170,68130,72135,76113,77084,78200,80109,83136,86126,87090,90133,91073,97115,98098]
[null,null,20249,21219,23364,24203,29075,31144,25087,28516,9350,34106,36135,39085,42095,44307,50226,58116,62570,63129,64178,68133,72140,76114,77085,78209,80110,83137,86127,87093,90134,91075,97115,98099]
[null,null,20250,21220,23365,24204,29076,31146,25088,28520,9359,34107,36140,39086,42097,44320,50227,58117,62573,63130,64180,68140,72150,76115,77086,78210,80120,83138,86129,87099,90135,91080,97115,98100]
[null,null,20255,21224,23366,24205,29077,31150,25090,28521,9360,34108,36142,39087,42098,44329,50228,58118,62653,63135,64186,68143,72154,76116,77090,78213,80128,83139,86130,87100,90137,91083,97115,98113]
[null,null,20256,21225,23390,24206,29078,31153,25092,28523,7890,34109,36143,39089,42099,44330,50230,58120,62654,63136,64190,68144,72160,76117,77098,78214,80130,83140,86137,87110,90138,91084,97115,98140]
[null,null,20257,21226,23395,24207,29080,31160,25093,28530,7899,34110,36149,39090,42100,44340,50233,58127,62655,63137,64200,68146,72170,76118,77099,78215,80135,83143,86140,87120,90139,91090,97116,98150]
[null,null,20259,21229,23400,24348,29086,31170,25094,28531,7900,34113,36150,39093,42101,44350,50235,58128,62656,63138,64204,68148,72176,76120,77100,78216,80139,83144,86143,87130,90140,91093,97116,98153]
[null,null,20260,21230,23403,24350,29087,31180,25096,28550,7910,34116,36155,39094,42102,44360,50236,58130,62660,63139,64205,68149,72180,76121,77104,78218,80140,83145,86144,87133,90145,91094,97117,98160]
[null,null,20263,21239,23405,24353,29089,31183,25097,28553,7918,34119,36156,39095,42110,44370,50240,58140,62662,63150,64206,68150,72189,76125,77105,78219,80143,83146,86149,87134,90147,91095,97117,98163]
[null,null,20140,21240,23670,24354,29090,31184,25100,28555,7919,34120,36158,39096,42111,44380,50245,58145,62663,63155,64209,68153,72190,76127,77106,78220,80144,83147,86150,87135,90150,91096,97117,98170]
[null,null,20146,21250,23676,24355,29094,31186,25107,28557,7920,34123,36159,39097,42113,44390,50246,58146,62664,63156,64210,68154,72193,76130,77107,78230,80145,83148,86153,87136,90151,91097,97117,98173]
[null,null,20149,21254,23677,24356,29096,31200,25110,28590,7930,34124,36160,39098,42115,44395,50250,58147,62665,63157,64215,68155,72194,76134,77108,78233,80150,83149,86160,87137,90152,91098,97117,98174]
[null,null,20150,21255,23678,24357,29098,31203,25113,28597,7939,34125,36169,39100,42116,44398,50253,58148,62666,63158,64217,68156,72197,76135,77110,78234,80155,83150,86167,87138,90155,91100,97118,98175]
[null,null,20157,21257,23680,24358,29100,31204,25114,28599,7940,34126,36170,39101,42117,44399,50254,58149,62668,63159,64218,68157,72200,76136,77114,78235,80159,83156,86168,87140,90156,91103,97118,98176]
[null,null,20158,21258,23683,24364,29112,31205,25115,28600,7950,34127,36172,39102,42119,44400,50255,58150,62670,63160,64219,68159,72210,76137,77115,78236,80160,83157,86169,87149,90160,91104,97118,98177]
[null,null,20159,21259,23690,24365,29120,31206,25116,28865,7960,34128,36200,39103,42120,44410,50256,58158,62676,63163,64220,68200,72219,76138,77116,78238,80170,83159,86170,87150,90163,91105,97119,98180]
[null,null,20160,21260,23695,24366,29125,31207,25117,28867,7969,34129,36203,39104,42122,44419,50257,58160,62680,63164,64225,68204,72220,76139,77117,78239,80176,83160,86179,87160,90164,91106,97119,98183]
[null,null,20164,21270,23696,24367,29127,31208,25120,28868,7970,34130,36204,39105,42123,44420,50258,58168,62684,63165,64226,68205,72223,76140,77118,78240,80177,83165,86180,87163,90165,91107,97119,98184]
[null,null,20169,21279,23697,24368,29129,31210,25123,28869,7979,34135,36205,39107,42124,44430,50260,58170,62685,63166,64227,68207,72225,76144,77120,78250,80178,83166,86189,87170,90166,91110,97119,98185]
[null,null,20170,21280,23700,24369,29130,31213,25124,28870,7980,34136,36206,39110,42125,44440,50263,58175,62686,63167,64228,68208,72227,76146,77121,78258,80179,83170,86190,87173,90168,91113,97120,98186]
[null,null,20172,21285,23708,24645,29133,31214,25125,28872,7990,34137,36207,39111,42127,44450,50264,58178,62687,63168,64229,68210,72228,76147,77123,78260,80180,83171,86193,87180,90170,91114,97120,98200]
[null,null,20174,21289,23710,24646,29136,31215,25128,28880,8000,34138,36210,39112,42130,44460,50265,58179,62690,63169,64230,68213,72229,76148,77125,78268,80184,83173,86200,87183,90180,91119,97120,98203]
[null,null,20175,21290,23715,24647,29140,31216,25130,28885,8010,34139,36212,39113,42133,44467,50266,58180,62693,63170,64233,68214,72230,76149,77130,78269,80189,83174,86203,87200,90182,91120,97120,98204]
[null,null,20306,21297,23720,24648,29142,31217,25137,28886,8020,34140,36213,39115,42134,44469,50270,58183,62694,63172,64234,68216,72240,76150,77135,78270,80190,83175,86205,87202,90183,91123,97125,98205]
[null,null,20310,21298,23721,24653,29143,31220,25138,28900,8030,34143,36214,39116,42135,44470,50273,58186,62743,63173,64235,68217,72243,76154,77140,78280,80194,83176,86206,87203,90193,91129,97125,98209]
[null,null,20313,21299,23723,24654,29144,31223,25140,28910,8040,34144,36215,39118,42136,44490,50274,58187,62744,63412,64236,68218,72250,76155,77144,78290,80197,83177,86207,87204,90194,91130,97127,98210]
[null,null,20314,21300,23730,24656,29145,31300,25146,28915,8100,34145,36216,39119,42137,44493,50280,58188,62746,63413,64237,68219,72260,76156,77145,78294,80199,83178,86208,87205,90195,91133,97127,98211]
[null,null,20316,21307,23734,24658,29146,31304,25147,28920,8200,34146,36217,39120,42138,44500,50283,58189,62747,63414,64238,68220,72266,76157,77146,78295,80200,83179,86209,87206,90200,91140,97128,98212]
[null,null,20319,21309,23736,24660,29147,31310,25150,28923,8210,34147,36218,39122,42139,44509,50284,58190,62748,63415,64240,68222,72267,76158,77147,78298,80210,83180,86214,87207,90202,91143,97128,98220]
[null,null,20320,21310,23737,24663,29148,31313,25154,28929,8220,34150,36220,39123,42140,44510,50285,58194,62754,63416,64244,68224,72270,76159,77148,78300,80220,83188,86215,87208,90203,91150,97128,98222]
[null,null,20323,21320,23739,24667,29149,31314,25155,28930,8230,34156,36223,39125,42143,44520,50286,58195,62755,63420,64245,68226,72280,76160,77150,78307,80225,83190,86216,87209,90204,91152,97129,98223]
[null,null,20324,21323,23740,24668,29150,31350,25156,28934,8240,34157,36224,39126,42144,44530,50290,58196,62790,63421,64246,68227,72290,76164,77156,78308,80227,83200,86220,87210,90205,91153,97130,98224]
[null,null,20326,21324,23743,24670,29151,31370,25157,28935,8300,34158,36225,39127,42145,44535,50293,58197,62793,63423,64247,68228,72300,76165,77158,78309,80228,83204,86230,87211,90207,91154,97130,98229]
[null,null,20328,21326,23748,24700,29160,31375,25160,28936,8310,34159,36227,39128,42146,44538,50294,58199,62794,63424,64248,68230,72303,76166,77160,78310,80230,83205,86233,87212,90208,91155,97130,98230]
[null,null,20329,21327,23749,24703,29163,31376,25167,28937,8320,34160,36228,39129,42149,44540,50295,58200,62795,63425,64249,68232,72304,76168,77163,78318,80240,83206,86235,87213,90210,91156,97130,98234]
[null,null,20330,21330,23750,24704,29164,31380,25168,28938,8400,34162,36230,39130,42150,44549,50300,58210,62796,63426,64250,68233,72307,76169,77169,78319,80246,83207,86236,87214,90213,91157,97130,98235]
[null,null,20333,21337,23760,24083,29165,31384,25169,28940,8420,34163,36233,39131,42151,44550,50303,58216,62797,63427,64258,68234,72308,76170,77170,78320,80247,83208,86237,87215,90214,91158,97130,98236]
[null,null,20126,21339,23765,24084,29166,31385,25170,28944,8500,34164,36234,39132,42152,44559,50304,58217,62800,63429,64259,68235,72309,76175,77174,78328,80248,83209,86238,87216,90218,91160,97130,98237]
[null,null,20127,21340,23766,24085,29167,31390,25179,28945,8510,34165,36235,39133,42153,44560,50305,58218,62802,63430,64260,68236,72310,76176,77175,78330,80249,83210,86240,87220,90220,91163,97130,98238]
[null,null,20128,21350,23767,24086,29168,31410,25180,28947,8600,34166,36236,39134,42154,44580,50306,58219,62803,63434,64264,68237,72314,76177,77176,78338,80250,83214,86243,87223,90222,91164,97130,98239]
[null,null,20129,21353,23770,24087,29169,31414,25186,28950,8610,34167,36237,39135,42156,44600,50310,58220,62804,63435,64265,68238,72320,76178,77177,78339,80260,83220,86244,87224,90224,91165,97130,98240]
[null,null,20130,21354,23771,24088,29170,31415,25188,28952,8620,34168,36240,39136,42157,44610,50313,58226,62805,63436,64266,68240,72330,76179,77178,78340,80270,83223,86245,87227,90225,91166,97130,98241]
[null,null,20135,21355,23774,24089,29174,31416,25190,28955,8650,34169,36243,39137,42160,44619,50314,58227,62806,63437,64268,68244,72340,76180,77180,78342,80279,83224,86246,87228,90226,91170,97130,98250]
[null,null,20136,21356,23775,24090,29176,31450,25193,28958,8700,34170,36244,39138,42162,44620,50315,58228,62810,63438,64269,68247,72350,76185,77185,78348,80280,83229,86247,87229,90230,91173,97130,98253]
[null,null,20137,21360,23780,24208,29177,31453,25194,28959,8710,34175,36245,39140,42163,44630,50323,58229,62813,63440,64270,68248,72359,76190,77188,78349,80290,83230,86250,87230,90231,91174,97133,98254]
[null,null,20138,21370,23789,24300,29178,31455,25195,28960,8720,34176,36246,39141,42164,44635,50324,58230,62814,63443,64280,68250,72360,76197,77189,78350,80294,83240,86253,87232,90233,91179,97133,98256]
[null,null,20740,21376,23790,24310,29179,31456,25196,28963,8730,34179,36247,39142,42165,44647,50325,58240,62815,63444,64290,68254,72364,76199,77190,78356,80295,83243,86254,87233,90234,91180,97133,98260]
[null,null,20741,21378,23800,24313,29180,31460,25197,28965,8760,34180,36250,39143,42170,44648,50326,58244,62820,63445,64299,68256,72365,76210,77196,78357,80296,83244,86255,87235,90235,91183,97133,98261]
[null,null,20742,21379,23805,24314,29183,31470,25198,28968,8770,34185,36253,39144,42171,44650,50330,58245,62823,63446,64300,68257,72370,76211,77197,78358,80297,83245,86256,87236,90240,91184,97134,98262]
[null,null,20744,21380,23810,24315,29190,31500,25199,28979,8800,34186,36254,39145,42175,44656,50333,58248,62923,63447,64310,68258,72373,76212,77198,78359,80298,83246,86257,87237,90241,91185,97134,98263]
[null,null,20746,21383,23812,24316,29191,31510,25200,28980,1619,34187,36255,39149,42176,44657,50334,58249,62924,63449,64320,68259,72377,76213,77200,78360,80299,83247,86258,87238,90243,91186,97134,98264]
[null,null,20748,21384,23813,24317,29193,31512,25203,28982,1620,34188,36256,39150,42177,44658,50335,58250,62925,63536,64330,68260,72380,76214,77210,78363,80300,83248,86260,87239,90244,91190,97135,98265]
[null,null,20749,21385,23818,24370,29200,31513,25204,28983,1630,34189,36257,39151,42178,44660,50336,58253,62926,63537,64339,68261,72390,76215,77214,78364,80301,83249,86265,87240,90245,91193,97136,98267]
[null,null,20750,21386,23820,24372,29210,31515,25206,28984,1640,34190,36258,39154,42179,44665,50337,58254,62927,63538,64340,68262,72400,76216,77215,78365,80302,83250,86266,87244,90246,91194,97137,98270]
[null,null,20768,21387,23456,24373,29213,31516,25207,28985,1645,34193,36259,39155,42180,44667,50340,58255,62930,63539,64344,68263,72403,76217,77216,78366,80303,83260,86270,87245,90247,91195,97138,98275]
[null,null,20770,21389,23460,24374,29215,31517,25208,28986,1650,34194,36260,39159,42181,44668,50343,58256,62933,63540,64345,68264,72410,76218,77217,78367,80304,83270,86273,87247,90250,91196,97138,98277]
[null,null,20773,21390,23462,24375,29216,31520,25209,28987,1700,34195,36263,39160,42182,44670,50344,58257,62934,63543,64346,68266,72420,76219,77220,78368,80305,83278,86274,87248,90251,91197,97138,98278]
[null,null,20780,21394,23463,24376,29217,31522,25210,28988,1708,34196,36264,39162,42183,44678,50345,58258,62935,63548,64347,68267,72423,76220,77229,78369,80308,83280,86275,87249,90253,91198,97138,98279]
[null,null,20782,21395,23467,24377,29218,31523,25215,28989,1710,34197,36265,39163,42184,44679,50350,58259,62936,63549,64348,68268,72424,76221,77230,78370,80309,83283,86276,87250,90255,91200,97138,98280]
[null,null,20785,21396,23890,24400,29220,31524,25220,28078,1720,34198,36266,39164,42185,44680,50353,58260,62937,63550,64349,68269,72425,76223,77238,78377,80310,83284,86277,87253,90256,91203,97138,98281]
[null,null,20790,21397,23893,24402,29223,31526,25225,28079,1729,34199,36267,39165,42186,44689,50354,58270,62940,63552,64350,68270,72430,76224,77239,78378,80311,83285,86278,87254,90257,91205,97138,98285]
[null,null,20795,21398,23894,24705,29230,31527,25230,28080,1730,34200,36268,39166,42187,44690,50355,58277,62943,63553,64360,68273,72440,76225,77240,78379,80313,83286,86280,87255,90258,91207,97138,98286]
[null,null,20796,21399,23895,24706,29233,31528,25238,28085,1740,34204,36270,39169,42188,44700,50356,58278,62950,63554,64365,68274,72450,76226,77249,78380,80314,83287,86281,87256,90259,91210,97138,98287]
[null,null,20799,21400,23896,24707,29235,31529,25239,28089,1750,34205,36273,39170,42190,44710,50357,58280,62952,63533,64366,68275,72453,76227,77250,78384,80315,83288,86283,87257,90260,91213,97138,98290]
[null,null,20800,21410,23000,24720,29236,31530,25240,28090,1759,34206,36274,39172,42191,44716,50360,58290,62953,63534,64367,68276,72456,76228,77259,78385,80316,83289,86284,87258,90261,91214,97138,98295]
[null,null,20802,21420,23007,24723,29239,31532,25250,28100,1760,34207,36275,39173,42192,44719,50370,58295,62954,63535,64368,68277,72459,76229,77300,78387,80317,83290,86287,87259,90262,91215,97138,98296]
[null,null,20803,21430,23009,24730,29240,31533,25253,28110,1770,34208,36276,39174,42194,44720,50373,58296,62955,63635,64369,68278,72460,76230,77302,78388,80318,83293,86288,87260,90263,91216,97138,98297]
[null,null,20804,21432,23010,24732,29242,31540,25254,28113,1780,34209,36277,39175,42195,44723,50374,58297,62824,63636,64370,68280,72464,76233,77303,78389,80319,83294,86289,87261,90264,91217,97138,98300]
[null,null,20805,21433,23017,24733,29243,31542,25256,28114,1789,34210,36278,39177,42196,44724,50375,58300,62825,63637,64380,68283,72468,76235,77304,78390,80320,83295,86290,87262,90265,91220,97139,98303]
[null,null,20810,21440,23018,24734,29244,31543,25260,28120,1790,34214,36279,39178,42198,44725,50376,58301,62826,63638,64390,68284,72470,76237,77305,78394,80322,83296,86291,87263,90266,91223,97139,98304]
[null,null,20816,21442,23019,24740,29246,31544,25265,28123,1800,34215,36280,39179,42200,44726,50380,58302,62827,63640,64400,68285,72474,76238,77306,78395,80323,83297,86292,87265,90267,91224,97139,98306]
[null,null,20177,21447,23020,24746,29247,31550,25270,28130,1807,34216,36283,39180,42201,44727,50383,58303,62828,63643,64410,68287,72477,76240,77307,78396,80324,83299,86293,87266,90270,91225,97140,98307]
[null,null,20179,21448,23026,24800,29249,31552,25277,28133,1810,34217,36284,39183,42203,44729,50384,58304,62830,63644,64420,68288,72478,76243,77310,78397,80327,83300,86294,87267,90271,91226,97140,98310]
[null,null,20180,21449,23029,24810,29250,31555,25279,28134,1820,34218,36285,39190,42204,44730,50385,58310,62832,63645,64430,68290,72480,76244,77320,78398,80330,83303,86295,87270,90273,91227,97140,98311]
[null,null,20190,21450,23030,24813,29254,31560,25280,28140,1830,34219,36286,39193,42205,44737,50386,58312,62833,63646,64440,68293,72482,76245,77330,78399,80332,83304,86297,87273,90274,91230,97142,98317]
[null,null,20196,21452,23034,24820,29255,31570,25284,28143,1840,34220,36287,39195,42208,44739,50393,58313,62834,63648,64450,68297,72483,76246,77333,78400,80333,83305,86298,87274,90275,91231,97142,98318]
[null,null,20198,21453,23037,24826,29256,31572,25285,28150,1849,34224,36288,39196,42209,44740,50394,58314,62835,63650,64460,68299,72484,76247,77350,78403,80334,83306,86300,87277,90276,91233,97142,98320]
[null,null,20199,21460,23038,24828,29258,31573,25286,28159,6760,34225,36290,39197,42210,44748,50395,58317,62840,63652,64470,68300,72490,76248,77355,78404,80335,83307,86320,87278,90277,91236,97142,98330]
[null,null,20200,21462,23039,24830,29259,31579,25290,28160,6780,34226,36293,39198,42211,44750,50396,58320,62843,63655,64480,68310,72492,76249,77360,78405,80336,83309,86323,87279,90278,91237,97143,98336]
[null,null,20298,21470,23100,24831,29260,31580,25293,28170,6800,34227,36294,39199,42215,44755,50397,58321,62844,63656,64488,68313,72494,76250,77366,78406,80337,83310,86324,87284,90280,91238,97143,98340]
[null,null,20299,21472,23106,24836,29263,31590,25294,28180,6820,34228,36295,39200,42220,44757,50400,58322,62845,63657,64489,68314,72495,76251,77367,78407,80338,83313,86325,87300,90283,91240,97143,98343]
[null,null,20300,21477,23130,24837,29264,31600,25295,28184,6840,34229,36296,39202,42221,44760,50410,58323,62775,63658,64490,68320,72496,76252,77368,78410,80339,83314,86330,87310,90284,91241,97143,98344]
[null,null,20303,21478,23133,24839,29265,31604,25296,28189,6850,34230,36297,39203,42222,44765,50413,58324,62776,63660,64500,68322,72497,76253,77369,78413,80345,83315,86340,87313,90285,91243,97143,98350]
[null,null,20304,21479,23134,24860,29266,31605,25297,28190,6860,34233,36298,39204,42223,44766,50414,58330,62777,63670,64508,68323,72498,76254,77370,78414,80346,83316,86350,87314,90286,91244,97143,98351]
[null,null,20305,21480,23140,24863,29267,31606,25298,28610,6870,34234,36300,39205,42224,44768,50415,58331,62778,63700,64510,68324,72499,76255,77376,78415,80347,83317,86357,87315,90287,91245,97143,98353]
[null,null,20334,21482,23143,24900,29269,31607,25300,28613,6880,34235,36310,39206,42225,44769,50420,58332,62780,63702,64517,68325,72500,76256,77377,78416,80348,83320,86360,87316,90288,91246,97144,98354]
[null,null,20335,21483,23150,24902,29270,31608,25301,28620,6890,34236,36312,39207,42230,44770,50423,58333,62785,63544,64520,68326,72501,76257,77378,78418,80349,83323,86369,87317,90290,91247,97144,98355]
[null,null,20336,21484,23154,24903,29277,31609,25302,28626,6900,34237,36313,39208,42232,44780,50424,58334,62846,63545,64530,68330,72503,76258,77380,78420,80360,83324,86370,87318,90291,91248,97144,98360]
[null,null,20337,21485,23170,24904,29278,31610,25303,28627,6920,34238,36315,39209,42233,44790,50425,58335,62847,63546,64536,68333,72504,76259,77384,78421,80363,83325,86380,87319,90292,91249,97144,98363]
[null,null,20338,21490,23174,24905,29279,31611,25304,28628,7000,34239,36320,39210,42234,44799,50430,58336,62850,63547,64540,68334,72505,76260,77385,78423,80365,83326,86388,87320,90293,91250,97145,98364]
[null,null,20339,21496,23200,24910,29280,31612,25305,28629,7010,34240,36322,39211,42235,44800,50433,58337,62853,63742,64549,68335,72510,76261,77386,78424,80366,83327,86389,87324,90294,91252,97145,98365]
[null,null,20340,21500,23203,24913,29286,31613,25306,28630,7020,34250,36330,39212,42236,44810,50434,58338,62854,63743,64550,68336,72520,76262,77400,78425,80367,83328,86400,87326,90295,91253,97145,98367]
[null,null,20341,21503,23205,24914,29288,31614,25307,28633,7040,34260,36333,39216,42237,44815,50435,58340,62855,63744,64560,68337,72523,76263,77402,78426,80368,83330,86402,87330,90297,91254,97145,98368]
[null,null,20342,21505,23206,24026,29289,31615,25310,28634,7050,34269,36340,39217,42239,44817,50440,58341,62856,63745,64568,68340,72530,76264,77403,78427,80370,83333,86403,87340,90298,91255,97146,98369]
[null,null,20343,21506,23208,24027,29290,31620,25311,28635,7058,34270,36342,39218,42240,44818,50443,58342,62857,63750,64570,68345,72532,76265,77404,78430,80371,83334,86406,87343,90300,91256,97146,98370]
[null,null,20344,21507,23209,24028,29292,31622,25313,28640,7060,34277,36350,39219,42241,44820,50444,58343,62860,63751,64580,68347,72533,76266,77406,78432,80372,83335,86407,87344,90319,91257,97147,98380]
[null,null,20345,21508,23210,24029,29293,31623,25315,28645,7069,34278,36352,39220,42245,44824,50445,58344,62863,63753,64590,68350,72534,76267,77407,78433,80373,83336,86409,87345,90320,91260,97147,98383]
[null,null,20346,21510,23213,24030,29294,31624,25316,28646,7070,34279,36353,39221,42250,44825,50446,58345,62864,63754,64600,68353,72538,76268,77408,78434,80374,83337,86410,87346,90323,91270,97148,98387]
[null,null,20347,21511,23215,24035,29295,31625,25317,28647,7080,34280,36354,39223,42251,44827,50447,58346,62865,63755,64610,68360,72540,76269,77409,78435,80376,83338,86413,87347,90329,91273,97149,98390]
[null,null,20348,21514,23216,24036,29296,31626,25318,28655,7089,34284,36360,39224,42253,44828,50450,58347,62866,63756,64618,68363,72543,76270,77410,78436,80377,83340,86414,87348,90330,91274,97150,98400]
[null,null,20349,21517,23217,24037,29297,31627,25320,28656,7090,34285,36361,39225,42254,44829,50453,58348,62867,63757,64619,68364,72550,76272,77420,78437,80378,83342,86415,87349,90337,91275,97150,98401]
[null,null,20350,21519,23230,24038,29298,31628,25321,28700,7100,34286,36364,39229,42255,44840,50454,58350,62870,63758,64620,68365,72560,76273,77500,78438,80380,83343,86416,87350,90338,91277,97155,98403]
[null,null,20678,21520,23232,24039,29299,31630,25322,28703,7109,34287,36365,39230,42256,44860,50455,58352,62873,63760,64623,68370,72564,76274,77503,78439,80383,83344,86417,87360,90339,91278,97155,98404]
[null,null,20680,21530,23234,24040,29300,31631,25324,28704,7110,34289,36369,39232,42257,44870,50456,58353,62880,63762,64630,68373,72565,76276,77504,78440,80384,83346,86418,87370,90340,91280,97156,98405]
[null,null,20683,21536,23236,24044,29310,31632,25325,28705,7119,34290,36370,39233,42259,44890,50457,58355,62885,63763,64632,68374,72567,76277,77505,78443,80385,83347,86420,87380,90341,91282,97157,98406]
[null,null,20684,21550,23240,24049,29314,31633,25326,28720,7130,34298,36372,39234,42260,44895,50458,58356,62887,63764,64633,68375,72570,76278,77506,78444,80386,83348,86421,87382,90342,91283,97157,98410]
[null,null,20686,21553,23243,24050,29316,31640,25327,28724,7140,34299,36380,39235,42262,44896,50460,58357,62890,63765,64634,68376,72573,76279,77507,78445,80387,83349,86423,87383,90347,91284,97158,98413]
[null,null,20687,21570,23244,24156,29320,31643,25328,28730,7144,34300,36390,39236,42263,44897,50463,58358,62893,63766,64635,68400,72574,76280,77508,78446,80390,83350,86425,87385,90350,91285,97159,98416]
[null,null,20700,21573,23247,24157,29322,31644,25329,28733,7149,34303,36394,39237,42264,44898,50464,58359,62895,63770,64636,68402,72575,76281,77509,78447,80391,83353,86426,87389,90355,91288,97159,98417]
[null,null,20704,21600,23248,24158,29323,31645,25330,28734,7150,34304,36400,39240,42265,44899,50465,58360,62896,63771,64637,68403,72580,76282,77510,78448,80393,83354,86427,87390,90356,91289,97159,98419]
[null,null,20705,21606,23249,24160,29324,31646,25331,28735,7160,34305,36403,39241,42266,44900,50466,58362,62897,63772,64638,68404,72582,76283,77513,78450,80394,83355,86428,87393,90357,91290,97159,98420]
[null,null,20706,21607,23250,24166,29325,31647,25332,28736,7164,34306,36404,39249,42267,44910,50470,58363,62900,63773,64639,68405,72583,76284,77514,78453,80395,83356,86430,87394,90358,91293,97159,98422]
[null,null,20708,21609,23252,24167,29326,31650,25333,28750,7170,34307,36405,39250,42268,44918,50473,58364,62905,63774,64640,68406,72584,76286,77515,78454,80396,83357,86432,87395,90360,91300,97159,98423]
[null,null,20709,21610,23257,24169,29327,31652,25334,28760,7180,34308,36406,39252,42273,44919,50474,58365,62906,63775,64649,68407,72587,76288,77516,78455,80397,83360,86433,87396,90370,91302,97160,98424]
[null,null,20710,21611,23258,24170,29328,31653,25335,28764,9838,34310,36407,39253,42274,44920,50475,58380,62907,63776,64650,68408,72589,76289,77517,78456,80398,83363,86434,87397,90378,91303,97160,98425]
[null,null,20712,21613,23280,24178,29329,31657,25336,28765,9839,34313,36410,39255,42275,44929,50476,58383,62908,63777,64659,68410,72590,76290,77518,78457,80400,83364,86436,87398,90380,91304,97160,98426]
[null,null,20713,21614,23283,24179,29330,31660,25337,28766,9840,34314,36413,39256,42280,44930,50480,58384,62909,63957,64660,68411,72592,76293,77519,78460,80402,83365,86440,87399,90401,91305,97160,98429]
[null,null,20714,21615,23289,24343,29333,31663,25338,28767,9849,34316,36414,39257,42282,44940,50483,58390,62910,63958,64700,68412,72593,76294,77520,78463,80403,83366,86442,87400,90402,91306,97165,98430]
[null,null,20715,21620,23468,24344,29334,31665,25340,28770,9850,34317,36415,39258,42283,44948,50484,58391,62912,63959,64710,68413,72594,76295,77524,78464,80405,83367,86443,87410,90403,91307,97165,98432]
[null,null,20720,21627,23469,24345,29335,31667,25343,28772,9856,34320,36416,39259,42284,44949,50485,58398,62914,63960,64715,68415,72595,76296,77525,78465,80408,83370,86444,87413,90404,91310,97166,98435]
[null,null,20721,21628,23470,24346,29336,31670,25344,28773,9858,34323,36417,39260,42285,44950,50486,58399,62915,63963,64718,68416,72596,76297,77526,78466,80409,83373,86445,87415,90405,91312,97166,98436]
[null,null,20722,21700,23472,24347,29337,31671,25345,28774,9859,34324,36418,39261,42286,44956,50487,58400,62916,63967,64720,68417,72597,76298,77527,78467,80410,83374,86446,87420,90406,91315,97166,98440]
[null,null,20723,21703,23473,24460,29340,31672,25346,28780,9860,34325,36420,39263,42290,44959,50490,58403,62917,63968,64730,68418,72599,76299,77528,78470,80411,83375,86454,87430,90407,91320,97167,98444]
[null,null,20724,21704,23474,24462,29341,31673,25347,28784,9868,34326,36423,39264,42291,44960,50493,58404,62920,63969,64740,68419,72600,76300,77530,78473,80415,83376,86456,87438,90410,91322,97167,98445]
[null,null,20727,21705,23475,24464,29342,31674,25348,28000,9870,34330,36424,39265,42294,44966,50494,58406,62956,63970,64750,68420,72620,76303,77533,78474,80416,83377,86460,87440,90411,91323,97167,98450]
[null,null,20729,21706,23477,24500,29345,31675,25350,28010,9880,34334,36425,39266,42295,44967,50495,58407,62957,63973,64753,68422,72623,76304,77534,78475,80417,83380,86461,87444,90413,91325,97168,98451]
[null,null,20730,21710,23897,24505,29346,31677,25352,28014,9890,34340,36426,39267,42296,44969,50496,58410,62962,63974,64754,68424,72640,76309,77535,78476,80419,83383,86464,87445,90414,91327,97168,98452]
[null,null,20734,21713,23898,24517,29347,31680,25353,28016,9897,34345,36427,39269,42298,44970,50497,58412,62963,63975,64760,68425,72660,76310,77536,78477,80430,83384,86465,87446,90415,91330,97168,98453]
[null,null,20736,21720,23900,24520,29348,31681,25354,28017,9900,34346,36430,39270,42300,44977,50500,58413,62965,63980,64764,68426,72665,76313,77537,78480,80433,83390,86466,87447,90416,91334,97168,98460]
[null,null,20737,21722,23902,24522,29349,31683,25355,28018,9910,34350,36433,39271,42302,44978,50503,58414,62966,63985,64765,68427,72668,76314,77538,78483,80434,83393,86467,87448,90418,91335,97169,98463]
[null,null,20739,21723,23903,24523,29350,31684,25356,28019,9920,34354,36434,39272,42303,44980,50504,58415,62970,63990,64769,68428,72669,76315,77539,78484,80435,83394,86470,87449,90420,91336,97169,98464]
[null,null,20820,21725,23904,24532,29353,31685,25357,28020,9930,34357,36435,39273,42304,44984,50505,58416,62972,63996,64770,68430,72670,76316,77560,78485,80436,83395,86471,87450,90421,91337,97170,98471]
[null,null,20823,21730,23910,24536,29355,31686,25360,28023,9940,34358,36436,39274,42305,44985,50507,58420,62973,63555,64780,68432,72680,76317,77567,78486,80437,83396,86473,87453,90423,91338,97170,98473]
[null,null,20830,21731,23911,24537,29360,31687,25363,28025,9960,34360,36437,39275,42306,44986,50508,58423,62974,63556,64783,68433,72685,76318,77569,78490,80439,83397,86474,87454,90425,91339,97173,98474]
[null,null,20832,21735,23912,24540,29364,31688,25365,28030,9969,34363,36440,39277,42310,44987,50509,58424,62975,63557,64788,68434,72700,76319,77580,78493,80440,83400,86475,87455,90426,91340,97173,98480]
[null,null,20834,21738,23913,24550,29365,31690,25366,28035,9970,34364,36441,39279,42313,44989,50510,58425,62976,63558,64790,68435,72702,76320,77586,78494,80441,83403,86476,87456,90427,91341,97173,98490]
[null,null,20835,21740,23914,24552,29367,31691,25367,28037,10000,34365,36443,39280,42315,44990,50520,58426,62977,63559,64798,68436,72703,76321,77590,78495,80442,83419,86477,87457,90428,91345,97173,98492]
[null,null,20836,21742,23915,24553,29369,31693,25368,28040,10010,34366,36444,39281,42316,45010,50523,58430,62978,63560,64800,68437,72704,76323,77600,78496,80443,83420,86478,87458,90430,91346,97173,98494]
[null,null,20840,21743,23916,24557,29370,31694,25369,28043,10020,34371,36445,39282,42317,45012,50524,58433,62980,63561,64810,68438,72705,76324,77609,78497,80444,83423,86480,87459,90432,91350,97173,98496]
[null,null,20842,21800,23917,24560,29372,31695,25370,28044,10130,34373,36446,39283,42320,45014,50525,58435,62982,63562,64820,68440,72706,76325,77610,78500,80447,83430,86483,87460,90433,91353,97173,98500]
[null,null,20844,21801,23920,24561,29373,31696,25372,28045,10200,34375,36447,39284,42321,45015,50526,58436,62983,63563,64830,68442,72707,76326,77613,78502,80449,83439,86484,87469,90434,91354,97174,98502]
[null,null,20850,21802,23478,24562,29374,31697,25373,28046,10300,34376,36450,39286,42323,45016,50527,58440,62984,63564,64834,68443,72710,76327,77620,78503,80450,83440,86485,87470,90435,91360,97174,98503]
[null,null,20852,21810,23500,24564,29376,31698,25374,28047,10320,34377,36452,39287,42324,45017,50528,58442,62985,63565,64836,68444,72712,76330,77622,78506,80452,83447,86486,87475,90436,91363,97175,98504]
[null,null,20205,21813,23501,24570,29377,31699,25375,28048,10330,34378,36453,39288,42325,45018,50540,58443,62986,63567,64840,68445,72713,76333,77645,78508,80453,83448,86490,87476,90437,91364,97176,98505]
[null,null,20206,21820,23503,24572,29380,31700,25376,28050,10340,34380,36454,39289,42326,45019,50550,58444,62987,63568,64845,68446,72720,76334,77660,78510,80454,83449,86493,87477,90438,91367,97176,98506]
[null,null,20207,21821,23510,24573,29382,31704,25380,28060,10350,34383,36456,39290,42327,45020,50553,58445,62988,63570,64850,68447,72723,76335,77664,78511,80455,83450,86495,87490,90440,91370,97176,98507]
[null,null,20208,21830,23520,24574,29383,31710,25382,28063,10360,34384,36457,39291,42330,45027,50554,58446,62990,63573,64858,68448,72724,76336,77665,78512,80457,83455,86500,87493,90443,91372,97176,98508]
[null,null,20210,21831,23522,24575,29384,31719,25385,28067,10368,34385,36458,39294,42332,45030,50559,58447,62993,63575,64859,68449,72725,76337,77666,78513,80460,83457,86520,87494,90444,91373,97176,98510]
[null,null,20217,21832,23523,24600,29385,31720,25386,28070,10369,34386,36459,39299,42333,45034,50560,58448,62994,63576,64860,68450,72730,76340,77667,78514,80463,83458,86523,87495,90445,91374,97177,98513]
[null,null,20218,21833,23530,24604,29386,31730,25387,28075,14476,34387,36460,39300,42334,45036,50563,58450,62995,63577,64865,68451,72733,76342,77670,78520,80464,83459,86524,87496,90446,91375,97178,98514]
[null,null,20219,21840,23533,24605,29387,31735,25389,28077,14479,34390,36462,39350,42335,45037,50564,58453,62996,63578,64878,68452,72735,76344,77673,78523,80465,83470,86527,87497,90447,91376,97179,98515]
[null,null,20220,21841,23535,24606,29390,31750,25390,28970,14480,34393,36463,39355,42336,45038,50565,58454,62388,63579,64880,68456,72750,76345,77675,78524,80466,83479,86528,87498,90448,91377,97179,98516]
[null,null,20229,21843,23560,24607,29395,31755,25393,28973,14490,34394,36464,39360,42337,45039,50566,58455,62389,63580,64890,68457,72754,76346,77676,78525,80467,83480,86529,87499,90450,91378,97180,98517]
[null,null,20230,21850,23563,24609,29400,31758,25395,28974,14500,34395,36465,39370,42338,45040,50567,58456,62390,63582,64893,68458,72755,76347,77689,78526,80468,83487,86530,87500,90453,91379,97189,98519]
[null,null,20234,21853,23567,24610,29403,31760,25396,28975,14600,34397,36466,39390,42339,45047,50570,58460,62398,63583,64898,68459,72756,76348,77710,78527,80470,83488,86533,87503,90454,91380,97189,98520]
[null,null,20235,21854,23570,24611,29405,31770,25398,28976,14608,34398,36467,39405,42340,45049,50573,58463,62399,63584,64899,68460,72757,76350,77712,78530,80473,83489,86534,87504,90455,91382,97190,98523]
[null,null,20236,21855,23574,24612,29410,31777,25399,28977,14609,34400,36468,39406,42341,45050,50574,58464,62400,63586,64900,68462,72760,76353,77713,78533,80475,83490,86535,87505,90456,91383,97190,98526]
[null,null,20392,21900,23575,24613,29412,31778,25400,28978,14610,34403,36470,39407,42342,45053,50575,58465,62409,63587,64909,68463,72762,76354,77714,78534,80480,83496,86540,87506,90457,91384,97195,98530]
[null,null,20393,21902,23580,24615,29414,31780,25406,28200,14620,34404,36473,39412,42343,45054,50583,58466,62410,63590,64910,68464,72764,76355,77716,78535,80481,83497,86543,87507,90458,91385,97195,98540]
[null,null,20394,21903,23581,24620,29415,31783,25410,28209,14629,34405,36474,39422,42344,45055,50584,58467,62420,63593,64920,68465,72765,76356,77717,78536,80483,83498,86544,87510,90459,91387,97195,98541]
[null,null,20395,21904,23586,24622,29416,31789,25413,28218,14630,34406,36475,39430,42345,45056,50590,58468,62428,63594,64925,68466,72766,76357,77718,78537,80484,83499,86545,87511,90460,91389,97195,98545]
[null,null,20396,21905,23590,24623,29417,31803,25418,28219,14640,34407,36476,39450,42346,45057,50596,58480,62430,63595,64926,68467,72767,76358,77720,78540,80485,83500,86546,87512,90463,91390,97195,98546]
[null,null,20400,21910,23593,24624,29419,31806,25419,28230,14643,34410,36477,39460,42348,45058,50597,58481,62433,63596,64930,68468,72768,76359,77723,78543,80486,83503,86547,87513,90465,91393,97195,98547]
[null,null,20403,21911,23597,24640,29420,31807,25420,28236,14646,34413,36480,39463,42351,45059,50600,58483,62440,63597,64940,68470,72770,76360,77724,78544,80489,83504,86550,87514,90470,91394,97196,98548]
[null,null,20404,21912,23600,24643,29430,31810,25428,28237,14647,34414,36483,39470,42352,45060,50601,58484,62445,63600,64949,68472,72772,76367,77725,78545,80490,83510,86553,87520,90480,91396,97196,98550]
[null,null,20405,21913,23610,24644,29432,31820,25430,28238,14650,34415,36484,39480,42353,45065,50603,58485,62446,63603,64950,68473,72774,76368,77726,78546,80491,83513,86554,87524,90482,91400,97196,98553]
[null,null,20406,21920,23620,24000,29433,31821,25431,28239,14653,34416,36485,39500,42354,45066,50604,58486,62447,63604,64960,68474,72775,76370,77727,78547,80492,83514,86555,87525,90484,91402,97196,98555]
[null,null,20410,21921,23630,24010,29434,31822,25440,28240,14655,34417,36486,39510,42355,45067,50610,58487,62448,63605,64968,68475,72776,76372,77728,78550,80493,83515,86556,87530,90490,91404,97198,98560]
[null,null,20414,21925,23640,24014,29435,31823,25443,28250,14657,34420,36487,39528,42356,45068,50613,58488,62450,63606,64969,68476,72777,76373,77730,78553,80496,83516,86560,87535,90491,91406,97198,98561]
[null,null,20415,21930,23641,24020,29437,31825,25446,28259,14658,34423,36490,39530,42357,45069,50614,58489,62460,63607,64970,68477,72778,76378,77733,78554,80498,83517,86564,87540,90493,91407,97198,98580]
[null,null,20416,21950,23650,24022,29438,31828,25447,28260,14659,34424,36493,39540,42359,45070,50615,58490,62466,63610,64978,68479,72803,76379,77734,78555,80500,83520,86570,87544,90494,91409,97199,98584]
[null,null,20417,21951,23653,24023,29439,31829,25450,28269,14700,34425,36494,39550,42360,45076,50616,58491,62469,63613,64979,68480,72805,76380,77735,78560,80503,83540,86573,87550,90495,91410,97203,98600]
[null,null,20420,21960,23658,24024,29440,31830,25460,28270,14710,34426,36495,39560,42363,45077,50617,58493,62470,63614,64980,68482,72810,76382,77740,78563,80504,83550,86574,87551,90496,91413,97203,98604]
[null,null,20423,21961,23660,24025,29441,31831,25463,28278,14720,34427,36496,39573,42364,45078,50625,58494,62473,63615,64983,68483,72813,76383,77760,78564,80505,83553,86576,87552,90497,91414,97203,98605]
[null,null,20424,21963,23440,24093,29444,31832,25470,28279,14730,34430,36497,39574,42366,45079,50626,58495,62474,63616,64984,68484,72814,76384,77762,78565,80520,83554,86577,87553,90498,91415,97203,98606]
[null,null,20425,21964,23443,24094,29446,31837,25480,28300,14734,34433,36500,39580,42367,45080,50627,58496,62475,63617,64985,68485,72815,76385,77763,78566,80524,83555,86580,87554,90500,91416,97203,98607]
[null,null,20426,21965,23444,24095,29450,31840,25483,28304,14735,34434,36510,39589,42368,45085,50630,58497,62480,63618,64986,68486,72817,76386,77764,78567,80526,83556,86583,87555,90502,91417,97203,98608]
[null,null,20427,21966,23445,24096,29451,31844,25490,28305,14737,34435,36511,39590,42370,45086,50633,58498,62490,63619,64987,68487,72819,76388,77766,78570,80527,83557,86584,87557,90503,91420,97203,98609]
[null,null,20430,21970,23450,24097,29453,31845,25494,28306,14738,34436,36512,39600,42372,45087,50634,58499,62493,63620,64988,68488,72820,76390,77768,78573,80530,83560,86590,87558,90505,91430,97203,98610]
[null,null,20434,21980,23453,24098,29454,31846,25495,28307,14739,34437,36513,39610,42373,45088,50635,58500,62494,63622,64989,68490,72823,76392,77772,78574,80533,83564,86596,87559,90506,91433,97203,98612]
[null,null,20355,22000,23454,24099,29455,31847,25496,28310,14740,34440,36515,39613,42374,45089,50636,58502,62496,63623,64990,68491,72824,76393,77774,78575,80534,83565,86597,87560,90507,91434,97203,98613]
[null,null,20356,22010,23455,24100,29460,31849,25500,28313,14748,34443,36520,39620,42375,45100,50637,58503,62497,63625,64996,68493,72825,76394,77776,78576,80535,83566,86598,87563,90508,91435,97203,98614]
[null,null,20357,22014,23824,24108,29461,31850,25503,28315,14749,34444,36524,39630,42376,45110,50640,58504,62498,63626,64997,68494,72826,76395,77785,78577,80536,83567,86599,87564,90509,91436,97203,98615]
[null,null,20358,22015,23830,24110,29462,31851,25504,28317,14760,34445,36525,39640,42377,45115,50653,58505,62499,63627,65000,68495,72828,76396,77786,78578,80537,83570,86600,87565,90510,91440,97203,98616]
[null,null,20363,22020,23834,24114,29463,31852,25505,28320,14900,34446,36526,39650,42379,45116,50654,58506,62508,63628,65001,68496,72830,76399,77793,78580,80540,83573,86601,87569,90513,91441,97203,98617]
[null,null,20364,22024,23837,24115,29470,31854,25506,28330,15000,34450,36530,39660,42380,45117,50655,58507,62510,63630,65004,68497,72833,76400,77794,78583,80543,83574,86602,87570,90514,91443,97203,98618]
[null,null,20366,22025,23838,24320,29471,31855,25507,28340,15010,34453,36540,39670,42381,45118,50656,58508,62514,63633,65010,68500,72835,76401,77795,78584,80544,83575,86603,87577,90515,91444,97203,98619]
[null,null,20367,22030,23840,24322,29472,31856,25508,28350,15020,34454,36541,39679,42382,45119,50660,58510,62515,63634,65030,68501,72836,76402,77796,78585,80545,83576,86605,87580,90520,91445,97203,98620]
[null,null,20369,22034,23844,24323,29473,31857,25522,28400,15100,34455,36542,39680,42383,45120,50663,58511,62517,63703,65032,68502,72837,76410,77800,78586,80550,83577,86606,87585,90525,91446,97203,98621]
[null,null,20370,22035,23845,24324,29474,31858,25530,28402,15200,34456,36544,39689,42384,45128,50664,58512,62233,63704,65033,68503,72840,76411,77805,78587,80553,83580,86607,87587,90526,91447,97203,98630]
[null,null,20371,22040,23860,24325,29475,31859,25532,28403,15210,34457,36545,39690,42386,45129,50665,58513,62237,63705,65034,68504,72843,76413,77806,78590,80554,83583,86608,87588,90527,91448,97203,98631]
[null,null,20372,22044,23870,24326,29476,31860,25533,28405,15220,34460,36546,39699,42387,45130,50666,58514,62239,63706,65036,68505,72845,76414,77807,78593,80555,83584,86609,87589,90530,91449,97203,98635]
[null,null,20373,22045,23873,24327,29477,31861,25534,28410,15230,34463,36547,39700,42389,45133,50667,58515,62240,63707,65040,68508,72846,76417,77808,78594,80556,83585,86610,87600,90534,91450,97203,98636]
[null,null,20374,22046,23880,24330,29480,31862,25535,28413,15240,34464,36550,39703,42390,45134,50668,58516,62243,63708,65042,68510,72848,76420,77809,78595,80557,83590,86611,87602,90535,91451,97203,98640]
[null,null,20375,22050,23883,24333,29481,31863,25536,28414,15250,34465,36554,39704,42392,45136,50670,58517,62245,63709,65057,68511,72850,76421,77850,78596,80560,83600,86613,87604,90540,91460,97203,98644]
[null,null,20376,22054,23884,24116,29482,31870,25540,28420,15260,34466,36555,39710,42393,45138,50673,58520,62247,63710,65059,68512,72860,76424,77858,78597,80563,83610,86615,87605,90542,91463,97203,98645]
[null,null,20377,22055,23885,24117,29483,31880,25543,28424,15270,34467,36556,39713,42394,45140,50674,58523,62248,63713,65070,68513,72861,76425,77859,78600,80564,83620,86616,87606,90543,91465,97203,98646]
[null,null,20378,22056,23886,24118,29486,31881,25544,null,7510,34470,36557,39714,42395,45145,50675,58524,62249,63714,65075,68514,72863,76426,77870,78601,80565,83621,86617,87607,90544,91466,97203,98647]
[null,null,20384,22100,23887,24119,29487,31883,25545,null,7520,34473,36558,39715,42396,45146,50676,58530,62250,63715,65076,68515,72864,76427,77874,78602,80566,83624,86618,87610,90545,91468,97203,98648]
[null,null,20386,22104,23888,24120,29489,31884,25547,null,7530,34474,36559,39720,42397,45147,50677,58531,62253,63717,65080,68518,72867,76434,77875,78603,80567,83630,86620,87612,90546,91469,97203,98650]
[null,null,20388,22105,23889,24129,29490,31885,25550,null,7540,34475,36560,39730,42399,45148,50678,58532,62260,63719,65088,68520,72900,76436,77876,78604,80570,83634,86621,87613,90547,91470,97203,98652]
[null,null,20389,22106,23085,24130,29493,31886,25554,null,7550,34476,36566,39740,42400,45149,50680,58533,62269,63720,65090,68523,72943,76440,77878,78605,80573,83635,86630,87614,90548,91473,97203,98653]
[null,null,20100,22110,23086,24139,29494,31890,25555,null,7560,34477,36567,39745,42403,45150,50683,58540,62270,63722,65092,68524,72960,76450,77880,78609,80574,83640,86640,87616,90550,91475,97203,98655]
[null,null,20110,22114,23088,24140,29495,31891,25560,null,7570,34480,36568,39746,42404,45157,50684,58542,62280,63723,65100,68527,72967,76453,77882,78610,80575,83650,86643,87617,90553,91476,97203,98658]
[null,null,20115,22115,23921,24150,29500,31893,25565,null,7580,34482,36570,39747,42405,45158,50685,58543,62283,63724,65110,68530,72970,76454,77883,78612,80576,83660,86644,87618,90554,91477,97203,98659]
[null,null,20116,22116,23922,24153,29503,31894,25567,null,7600,34483,36576,39750,42410,45159,50686,58544,62284,63726,65115,68532,72971,76460,77889,78620,80577,83663,86645,87619,90555,91478,97203,98660]
[null,null,20117,22117,23923,24154,29504,31895,25570,null,7620,34484,36577,39753,42411,45160,50687,58545,62285,63728,65116,68534,72973,76463,77890,78622,80580,83664,86650,87620,90556,91480,97204,98663]
[null,null,20118,22120,23924,24155,29506,31896,25571,null,7630,34485,36578,39759,42412,45167,50693,58546,62290,63729,65118,68535,72975,76464,77893,78624,80583,83665,86652,87622,90557,91481,97204,98664]
[null,null,20119,22123,23930,24404,29507,31897,25576,null,7640,34486,36580,39760,42413,45168,50694,58547,62293,63730,65140,68536,72977,76465,77894,78625,80584,83666,86654,87624,90558,91482,97204,98666]
[null,null,20120,22124,23934,24410,29508,31898,25580,null,7650,34487,36583,39770,42414,45169,50695,58550,62294,63732,65150,68537,72978,76470,77895,78626,80585,83670,86655,87625,90560,91484,97204,98667]
[null,null,20123,22125,23935,24411,29509,31899,25587,null,7670,34488,36584,39773,42416,45170,50696,58552,62295,63734,65200,68540,72980,76471,77896,78630,80586,83680,86657,87626,90562,91485,97204,98670]
[null,null,20124,22126,23936,24413,29510,31900,25590,null,7680,34490,36585,39774,42420,45176,50697,58557,62296,63735,65210,68542,72983,76474,77898,78633,80600,83690,86658,87627,90563,91486,97205,98673]
[null,null,20280,22127,23938,24414,29513,31901,25600,null,7700,34493,36586,39780,42422,45177,50700,58558,62300,63736,65220,68543,72984,76476,77899,78634,80603,83693,86660,87628,90564,91487,97205,98677]
[null,null,20283,22160,23940,24415,29514,31902,25610,null,7707,34494,36587,39787,42423,45178,50710,58559,62303,63737,65230,68544,72985,76477,77900,78635,80604,83695,86670,87629,90565,91488,97205,98680]
[null,null,20284,22163,23944,24416,29515,31904,25616,null,7708,34495,36588,39790,42424,45179,50713,58560,62304,63738,65234,68545,72986,76478,77904,78636,80606,83706,86680,87630,90567,91489,97205,98684]
[null,null,20285,22164,23948,24418,29516,31908,25617,null,7720,34496,36589,39799,42430,45180,50714,58563,62305,63739,65240,68547,72987,76483,77905,78637,80607,83710,86681,87636,90568,91490,97205,98689]
[null,null,20286,22165,23949,24419,29517,31910,25618,null,7730,34497,36590,39800,42433,45184,50715,58564,62306,63740,65243,68548,72988,76484,77906,78638,80610,83713,86682,87640,90570,91492,97205,98690]
[null,null,20287,22170,23950,24420,29518,31911,25619,null,7739,34500,36593,39803,42434,45185,50716,58566,62309,63000,65244,68550,72989,76485,77907,78639,80613,83714,86683,87650,90573,91493,97205,98692]
[null,null,20288,22180,23951,24421,29519,31915,25626,null,7740,34510,36595,39810,42435,45186,50717,58567,62320,63010,65249,68551,72990,76486,77910,78640,80614,83715,86684,87655,90575,91494,97205,98693]
[null,null,20289,22183,23952,24423,29520,31920,25627,null,7750,34513,36597,39813,42436,45187,50720,58570,62520,63018,65250,68552,72992,76489,77913,78643,80615,83716,86686,87660,90576,91495,97205,98694]
[null,null,20290,22185,23959,24424,29523,31921,25628,null,7754,34514,36599,39814,42437,45188,50724,58574,62523,63019,65255,68553,72993,76490,77914,78644,80620,83717,86687,87662,90577,91496,97205,98695]
[null,null,20296,22186,23960,24440,29524,31922,25629,null,7755,34515,36600,39815,42438,45189,50725,58578,62524,63020,65256,68555,72994,76492,77915,78645,80623,83720,86690,87664,90580,91498,97205,98696]
[null,null,20297,22190,23969,24441,29525,31924,25630,null,7760,34516,36610,39820,42439,45190,50726,58579,62525,63021,65257,68557,72995,76493,77916,78646,80625,83723,86692,87666,90583,91500,97205,98697]
[null,null,20600,22194,23970,24443,29526,31927,25640,null,7770,34517,36611,39830,42440,45198,50727,58580,62526,63022,65260,68558,72996,76494,77917,78647,80627,83724,86693,87668,90584,91503,97205,98698]
[null,null,20602,22195,23971,24450,29528,31928,25643,null,7780,34520,36612,39840,42443,45199,50733,58581,62527,63023,65270,68560,72997,76495,77920,78649,80630,83725,86694,87670,90585,91505,97205,98700]
[null,null,20603,22196,23972,24451,29530,31930,25644,null,7790,34523,36613,39845,42444,45200,50734,58585,62528,63030,65272,68561,73000,76496,77923,78660,80633,83727,86695,87673,90586,91506,97205,98704]
[null,null,20604,22200,23973,24459,29533,31931,25650,null,7800,34524,36614,39850,42445,45205,50736,58586,62529,63035,65276,68562,73005,76499,77924,78665,80634,83730,86696,87675,90590,91510,97205,98705]
[null,null,20607,22203,23980,null,29534,31933,25660,null,7810,34525,36615,39859,42446,45220,50737,58590,62530,63037,65280,68563,73008,76500,77925,78670,80635,83733,86697,87676,90592,91514,97205,98706]
[null,null,20610,22204,23983,null,29535,31940,25668,null,7820,34526,36620,39860,42447,45221,50740,58591,62534,63038,65288,68564,73009,76503,77926,78671,80636,83734,86698,87677,90594,91515,97205,98707]
[null,null,20614,22205,23988,null,29537,31942,25669,null,7830,34527,36624,39865,42448,45222,50743,58593,62535,63039,65289,68565,73010,76504,77927,78680,80639,83735,86700,87678,90595,91516,97205,98710]
[null,null,20615,22206,23990,null,29540,31943,25670,null,7838,34530,36625,39867,42450,45226,50744,58594,62536,63040,65290,68569,73011,76505,77930,78681,80640,83750,86702,87679,90596,91517,97205,98712]
[null,null,20616,22207,23997,null,29542,31944,25680,null,7839,34533,36626,39869,42453,45230,50750,58598,62540,63050,65299,68570,73012,76506,77933,78683,80643,83753,86703,87680,90600,91518,97205,98713]
[null,null,20620,22210,23077,null,29543,31945,25700,null,7840,34534,36630,39880,42457,45233,50753,58600,62543,63058,65300,68571,73013,76510,77934,78685,80644,83754,86704,87685,90605,91519,97205,98714]
[null,null,20622,22214,23078,null,29544,31950,25710,null,7850,34535,36631,39887,42459,45234,50754,58610,62544,63059,65302,68572,73014,76513,77935,78689,80645,83755,86705,87690,90606,91520,97206,98715]
[null,null,20634,22215,23079,null,29545,31953,25714,null,7858,34536,36633,39888,42460,45235,50755,58616,62545,63060,65336,68573,73015,76514,77936,78690,80646,83756,86706,87693,90608,91521,97206,98716]
[null,null,20635,22216,23080,null,29546,31954,25716,null,7859,34537,36640,39890,42461,45236,50760,58617,62546,63061,65340,68574,73020,76515,77937,78691,80670,83757,86707,87694,90610,91527,97206,98717]
[null,null,20637,22217,23083,null,29547,31955,25717,null,7860,34540,36643,39893,42462,45237,50764,58620,62547,63062,65347,68575,73021,76516,77940,78692,80673,83760,86708,87695,90620,91528,97206,98718]
[null,null,20650,22220,23084,null,29550,31956,25718,null,7869,34543,36644,39897,42466,45238,50770,58624,62550,63066,65348,68577,73023,76517,77943,78694,80674,83767,86709,87696,90623,91529,97206,98720]
[null,null,20656,22223,23406,null,29553,31957,25720,null,7870,34544,36645,39898,42470,45239,50773,58627,62553,63067,65350,68578,73025,76520,77944,78695,80675,83770,86710,87697,90624,91530,97206,98723]
[null,null,20657,22224,23407,null,29554,31958,25724,null,7880,34545,36646,39899,42473,45242,50774,58628,62554,63068,65357,68580,73026,76523,77945,78696,80677,83780,86711,87700,90630,91533,97206,98724]
[null,null,20658,22225,23420,null,29555,31959,25725,null,7889,34546,36648,39900,42474,45245,50775,58629,62555,63069,65390,68582,73027,76525,77946,78697,80678,83784,86714,87709,90635,91537,97206,98725]
[null,null,20659,22226,23425,null,29556,31960,25726,null,11270,34547,36649,39901,42475,45250,50780,58630,62574,63070,65395,68583,73028,76526,77947,78699,80679,83785,86715,87710,90640,91538,97206,98726]
[null,null,20663,22230,23426,null,29557,31962,25730,null,11280,34548,36650,39903,42480,45255,50783,58635,62575,63080,65400,68584,73029,76527,77950,78700,80680,83786,86720,87713,90643,91539,97206,98727]
[null,null,20665,22234,23427,null,29558,31963,25732,null,11289,34550,36659,39904,42481,45256,50785,58637,62576,63081,65410,68585,73030,76528,77953,78710,80683,83790,86722,87715,90644,91540,97206,98730]
[null,null,20666,22235,23428,null,29560,31964,25733,null,11290,34553,36660,39905,42485,45257,50800,58638,62577,63082,65415,68588,73036,76529,77954,78712,80684,83793,86723,87720,90645,91549,97206,98740]
[null,null,20667,22236,23429,null,29562,31965,25734,null,11300,34554,36666,39906,42486,45259,50810,58639,62578,63083,65419,68590,73037,76530,77955,78715,80685,83794,86724,87730,90646,91550,97206,98750]
[null,null,20668,22237,23434,null,29564,31967,25740,null,11310,34555,36667,39908,42488,45260,50813,58640,62580,63084,65420,68595,73040,76534,77957,78716,80686,83795,86725,87733,90650,91556,97206,98760]
[null,null,20670,22244,23435,null,29570,31970,25743,null,11320,34556,36668,39909,42490,45270,50814,58649,62583,63088,65429,68600,73042,76535,77959,78717,80687,83796,86726,87735,90653,91557,97206,98770]
[null,null,20673,22245,23436,null,29571,31973,25746,null,11330,34557,36669,39910,42491,45274,50815,58650,62584,63089,65430,68601,73045,76536,77960,78720,80700,83797,86727,87737,90660,91559,97206,98772]
[null,null,20674,22246,23437,null,29572,31975,25747,null,11340,34560,36670,39911,42492,45275,50816,58653,62585,63100,65436,68602,73046,76537,77962,78721,80702,83800,86728,87738,90670,91560,97206,98773]
[null,null,20675,22250,null,null,29573,31976,25748,null,11350,34563,36673,39914,42493,45276,50820,58654,62586,63109,65440,68603,73047,76538,77963,78722,80704,83801,86730,87740,90676,91565,97207,98775]
[null,null,20676,22253,null,null,29574,31977,25749,null,11360,34564,36680,39917,42494,45277,50823,58660,62587,63110,65449,68604,73048,76539,77965,78723,80705,83805,86732,87743,90680,91566,97207,98776]
[null,null,20677,22254,null,null,29575,31978,25750,null,11370,34565,36683,39918,42495,45279,50824,58664,62588,63779,65450,68605,73049,76540,77966,78724,80706,83810,86733,87744,90690,91567,97208,98780]
[null,null,20933,22255,null,null,29576,31979,25756,null,11400,34566,36687,39919,42500,45280,50825,58665,62590,63780,65460,68606,73050,76543,77970,78725,80707,83817,86734,87746,90692,91568,97208,98785]
[null,null,20934,22260,null,null,29578,31980,25757,null,11410,34567,36690,39920,42503,45281,50826,58667,62593,63782,65467,68607,73053,76544,77976,78726,80708,83818,86735,87747,90693,91569,97208,98790]
[null,null,20943,22263,null,null,29579,31983,25758,null,11420,34570,36691,39921,42504,45286,50830,58670,62594,63783,65468,68609,73054,76545,77977,78730,80720,83820,86736,87748,90700,91570,97208,98794]
[null,null,20947,22330,null,null,29580,31984,25760,null,11430,34573,36698,39922,42505,45287,50833,58676,62595,63784,65476,68610,73055,76546,77980,78740,80723,83830,86737,87750,90710,91575,97208,98795]
[null,null,20953,22333,null,null,29583,31985,25766,null,11440,34574,36699,39923,42506,45290,50834,58677,62596,63785,65477,68611,73056,76547,77983,78743,80724,83833,86738,87755,90712,91576,97208,98800]
[null,null,20954,22334,null,null,29585,31986,25767,null,11450,34575,36700,39924,42507,45299,50835,58680,62599,63786,65500,68612,73057,76548,77984,78745,80725,83834,86739,87760,90713,91579,97208,98804]
[null,null,20955,22335,null,null,29586,31987,25768,null,11460,34576,36704,39925,42510,45300,50836,58685,62600,63787,65503,68614,73058,76550,77985,78746,80726,83835,86740,87766,90715,91580,97209,98805]
[null,null,20956,22400,null,null,29587,31990,25770,null,11470,34577,36710,39926,42512,45303,50840,58688,62605,63788,65504,68617,73060,76553,77986,78747,80730,83837,86743,87767,90716,91581,97209,98807]
[null,null,20957,22404,null,null,29588,31991,25775,null,11480,34580,36714,39927,42523,45305,50843,58689,62606,63790,65505,68618,73063,76554,77987,78750,80733,83840,86744,87768,90717,91583,97210,98810]
[null,null,20970,22405,null,null,29590,31992,25776,null,11489,34583,36715,39928,42524,45306,50844,58690,62607,63792,65510,68620,73064,76555,77990,78759,80734,83860,86745,87769,90718,91584,97210,98812]
[null,null,20974,22406,null,null,29593,31994,25777,null,11490,34584,36717,39930,42600,45307,50845,58698,62608,63793,65513,68621,73065,76556,77992,78760,80735,83870,86746,87770,90721,91589,97210,98813]
[null,null,20983,22410,null,null,29594,31996,25780,null,11500,34585,36720,39931,42601,45308,50846,58701,62610,63794,65514,68622,73068,76557,77994,78769,80736,83890,86747,87780,90722,91601,97215,98815]
[null,null,20984,22414,null,null,29595,31997,25785,null,11510,34586,36722,39932,42602,45310,50847,58702,62613,63174,65515,68624,73069,76558,77995,78770,80737,83900,86748,87785,90723,91602,97215,98816]
[null,null,20990,22415,null,null,29596,32000,25790,null,11520,34587,36723,39934,42603,45314,50848,58703,62614,63175,65516,68627,73070,76560,77997,78779,80738,83903,86750,87790,90725,91603,97215,98817]
[null,null,20994,22416,null,null,29598,32010,25793,null,11529,34588,36724,39935,42604,45320,50850,58710,62615,63176,65517,68630,73071,76563,null,78780,80740,83904,86752,87793,90730,91604,97217,98818]
[null,null,20995,22420,null,null,29599,32020,25796,null,11530,34590,36726,39936,42607,45325,50860,58711,62616,63177,65520,68631,73072,76564,null,78783,80743,83905,86753,87794,90733,91606,97217,98820]
[null,null,20996,22424,null,null,29600,32030,25799,null,11540,34593,36730,39937,42608,45330,50863,58716,62620,63178,65523,68632,73073,76565,null,78784,80744,83906,86754,87795,90734,91607,97217,98824]
[null,null,20997,22425,null,null,29603,32040,25800,null,11550,34594,36732,39940,42610,45331,50864,58720,62624,63179,65524,68633,73074,76566,null,78785,80750,83907,86755,87797,90735,91608,97217,98825]
[null,null,20000,22426,null,null,29604,32050,25802,null,11560,34595,36733,39941,42613,45335,50865,58727,62625,63180,65525,68635,73075,76567,null,78786,80753,83910,86756,87798,90736,91609,97217,98827]
[null,null,20010,22427,null,null,29605,32060,25803,null,11570,34596,36740,39942,42616,45340,50866,58728,62626,63183,65526,68636,73076,76568,null,78788,80754,83913,86757,87799,90737,91610,97217,98830]
[null,null,20016,22430,null,null,29606,32070,25804,null,11580,34597,36743,39944,42620,45341,50867,58730,62630,63184,65527,68638,73077,76570,null,78789,80755,83915,86758,87800,90738,91611,97217,98832]
[null,null,20018,22434,null,null,29608,32080,25805,null,11590,34598,36744,39946,42621,45345,50868,58731,62633,63185,65528,68640,73080,76573,null,78790,80756,83916,86759,87801,90740,91612,97217,98833]
[null,null,20020,22435,null,null,29609,32090,25810,null,11600,34600,36747,39948,42622,45349,50869,58733,62634,63186,65530,68641,73087,76574,null,78792,80757,83917,86760,87803,90750,91615,97217,98834]
[null,null,20029,22436,null,null,29610,32100,25815,null,11610,34603,36748,39949,42623,45350,50870,58734,62635,63190,65533,68643,73088,76575,null,78793,80758,83920,86761,87804,90754,91618,97217,98835]
[null,null,20030,22439,null,null,29613,32107,25820,null,11619,34604,36749,39950,42624,45353,50874,58735,62636,63193,65534,68644,73089,76600,null,78796,80760,83923,86762,87805,90760,91619,97218,98836]
[null,null,20040,22440,null,null,29614,32108,25823,null,15860,34605,36750,39951,42625,45355,50880,58739,62640,63194,65535,68645,73090,76605,null,78797,80763,83924,86767,87806,90770,91620,97218,98837]
[null,null,20049,22444,null,null,29615,32109,25836,null,15870,34606,36752,39952,42626,45359,50883,58740,62643,63195,65536,68650,73091,76610,null,78798,80764,83925,86768,87808,90773,91621,97218,98838]
[null,null,20050,22446,null,null,29616,32110,25843,null,15900,34607,36753,39956,42627,45360,50884,58741,62644,63196,65537,68651,73094,76613,null,78799,80770,83926,86770,87810,90774,91622,97218,98839]
[null,null,20059,22450,null,null,29617,32120,25844,null,15960,34610,36754,39957,42629,45364,50885,58742,62645,63197,65543,68652,73096,76614,null,78800,80773,83927,86771,87813,90775,91623,97218,98840]
[null,null,20060,22454,null,null,29618,32127,25845,null,15970,34613,36759,39958,42630,45368,50886,58743,62646,63198,65544,68655,73097,76615,null,78801,80774,83930,86773,87816,90780,91625,97218,98844]
[null,null,20064,22455,null,null,29619,32130,25846,null,15980,34614,36760,39959,42640,45380,50890,58744,62647,63199,65545,68659,73098,76616,null,78802,80775,83931,86774,87819,90790,91630,97218,98846]
[null,null,20070,22456,null,null,29620,32140,25847,null,15990,34615,36764,39960,42642,45390,50893,58745,62695,63200,65546,68660,73099,76617,null,78803,80776,83935,86775,87820,90791,91633,97219,98850]
[null,null,20078,22457,null,null,29623,32150,25850,null,16000,34616,36765,39962,42643,45395,50894,58746,62696,63202,65547,68661,73100,76618,null,78804,80777,83937,86776,87822,90796,91634,97219,98860]
[null,null,20080,22460,null,null,29624,32153,25851,null,16010,34617,36766,39963,42644,45398,50895,58750,62697,63203,65548,68665,73101,76620,null,78805,80778,83960,86777,87823,90800,91635,97219,98870]
[null,null,20089,22464,null,null,29625,32159,25853,null,16020,34620,36770,39964,42645,45399,50896,58751,62700,63205,65550,68666,73103,76623,null,78808,80780,83961,86780,87824,90802,91636,97219,98873]
[null,null,20264,22465,null,null,29626,32160,25855,null,16029,34623,36773,39965,42646,45400,50900,58753,62704,63207,65554,68670,73110,76624,null,78810,80783,83964,86781,87825,90803,91637,97219,98880]
[null,null,20265,22470,null,null,29627,32170,25860,null,16030,34624,36774,39966,42647,45402,50903,58754,62710,63225,65555,68672,73112,76626,null,78811,80784,83970,86782,87826,90804,91640,97219,98884]
[null,null,20266,22473,null,null,29630,32177,25865,null,16034,34625,36775,39967,42650,45403,50904,58755,62713,63227,65556,68675,73113,76627,null,78812,80785,83974,86783,87827,90805,91643,97219,98885]
[null,null,20267,22474,null,null,29633,32178,25866,null,16035,34626,36776,39968,42651,45404,50906,58760,62714,63300,65558,68680,73114,76628,null,78814,80786,83980,86785,87829,90806,91644,97219,98887]
[null,null,20268,22476,null,null,29634,32180,25870,null,16036,34627,36777,39970,42653,45405,50907,58762,62715,63310,65559,68685,73115,76630,null,78815,80790,83981,86786,87830,90807,91645,97219,98888]
[null,null,20269,22500,null,null,29635,32190,25873,null,16038,34630,36778,39971,42654,45406,50910,58763,62717,63311,65560,68691,73117,76631,null,78816,80793,83983,86787,87831,90810,91646,97219,98890]
[null,null,20270,22504,null,null,29636,32200,25874,null,16040,34634,36780,39972,42655,45407,50920,58764,62718,63312,65562,68692,73119,76632,null,78818,80794,83990,86789,87832,90820,91647,97219,98893]
[null,null,20276,22505,null,null,29640,32210,25875,null,16050,34635,36782,39980,42656,45408,50924,58765,62720,63313,65563,68694,73120,76633,null,78819,80795,84000,86790,87834,90821,91649,97219,98894]
[null,null,20277,22506,null,null,29650,32215,25876,null,16059,34636,36783,39981,42660,45410,50925,58766,62723,63320,65564,68695,73128,76634,null,78820,80797,84009,86793,87835,90830,91650,97219,98900]
[null,null,20278,22510,null,null,29652,32217,25877,null,16060,34637,36784,39984,42663,45412,50926,58767,62724,63321,65565,68696,73129,76636,null,78821,80800,84010,86794,87840,90833,91652,97219,98904]
[null,null,20435,22515,null,null,29653,32220,25878,null,16070,34638,36785,39985,42664,45413,50927,58770,62725,63330,65567,68700,73130,76637,null,78822,80803,84014,86795,87841,90834,91653,97219,98905]
[null,null,20436,22516,null,null,29654,32223,25879,null,16080,34639,36786,39986,42665,45415,50930,58774,62730,63340,65573,68704,73134,76640,null,78824,80804,84015,86796,87843,90835,91654,97219,98907]
[null,null,20437,22517,null,null,29655,32230,25880,null,16083,34640,36787,39987,42666,45417,50933,58780,62732,63341,65580,68706,73135,76643,null,78825,80805,84017,86800,87844,90843,91655,97219,98910]
[null,null,20440,22520,null,null,29660,32234,25884,null,16090,34644,36790,39989,42667,45420,50934,58782,62733,63350,65583,68707,73140,76644,null,78827,80806,84018,86801,87847,90845,91656,97219,98913]
[null,null,20444,22523,null,null,29661,32240,25885,null,16100,34645,36793,39990,42670,45422,50935,58783,62735,63351,65600,68708,73141,76646,null,78830,80807,84020,86802,87848,90847,91657,97219,98914]
[null,null,20450,22524,null,null,29663,32250,25886,null,16200,34646,36800,39992,42671,45424,50940,58785,62736,63352,65650,68710,73142,76647,null,78836,80808,84024,86803,87849,90850,91658,97219,98918]
[null,null,20454,22525,null,null,29664,32260,25887,null,16210,34647,36803,39995,42672,45425,50943,58786,62737,63360,65653,68711,73147,76649,null,78837,80810,84030,86805,87853,90855,91659,97220,98919]
[null,null,20460,22526,null,null,29665,32270,25890,null,16240,34648,36804,39997,42673,45426,50944,58787,62738,63380,65654,68712,73160,76650,null,78840,80830,84035,86806,87854,90860,91660,97220,98920]
[null,null,20462,22530,null,null,29666,32280,25893,null,16300,34649,36805,40000,42680,45427,50945,58788,62739,63383,65660,68714,73161,76651,null,78841,80833,84040,86807,87858,90861,91663,97220,98921]
[null,null,20466,22534,null,null,29667,32290,25894,null,16310,34650,36806,40010,42682,45428,50946,58790,62740,63384,65663,68715,73162,76654,null,78843,80834,84046,86808,87860,90864,91664,97220,98923]
[null,null,20467,22535,null,null,29670,32295,25895,null,16320,34651,36807,40011,42683,45429,50960,58793,62742,63385,65700,68720,73163,76655,null,78844,80836,84047,86820,87865,90867,91666,97220,98924]
[null,null,20468,22536,null,null,29673,32299,25896,null,16340,34652,36810,40013,42684,45430,50963,58794,62756,63386,65706,68722,73164,76656,null,78845,80840,84048,86823,87870,90870,91667,97225,98925]
[null,null,20469,22537,null,null,29674,32300,25897,null,16400,34653,36813,40014,42685,45434,50964,58795,62757,63400,65719,68725,73165,76657,null,78847,80845,84050,86824,87873,90873,91668,97225,98930]
[null,null,20470,22540,null,null,29675,32310,25900,null,16410,34654,36814,40015,42686,45435,50965,58796,62760,63403,65750,68726,73166,76663,null,78850,80846,84055,86825,87875,90874,91670,97226,98931]
[null,null,20472,22544,null,null,29680,32315,25902,null,16420,34656,36815,40020,42689,45436,50966,58800,62763,63404,65760,68727,73167,76664,null,78851,80850,84060,86826,87880,90875,91672,97227,98933]
[null,null,20476,22545,null,null,29683,32317,25903,null,16428,34657,36816,40023,42690,45437,50967,58803,62764,63405,65766,68728,73168,76665,null,78853,80853,84062,86827,87883,90876,91673,97227,98936]
[null,null,20478,22550,null,null,29684,32319,25904,null,16429,34658,36817,40024,42693,45438,50970,58804,62765,63406,65776,68730,73169,76666,null,78855,80854,84063,86828,87884,90877,91674,97229,98940]
[null,null,20500,22555,null,null,29685,32320,25905,null,11650,34659,36818,40025,42694,45439,50973,58805,62766,63407,65780,68734,73170,76667,null,78856,80855,84064,86830,87885,90880,91675,97229,98941]
[null,null,20502,22557,null,null,29686,32330,25908,null,11700,34663,36821,40026,42695,45440,50974,58806,62767,63408,65783,68735,73172,76670,null,78858,80856,84065,86834,87886,90883,91676,97229,98942]
[null,null,20503,22560,null,null,29687,32340,25909,null,11800,34665,36822,40027,42700,45443,50975,58807,62768,63409,65800,68737,73173,76674,null,78859,80857,84066,86835,87887,90886,91677,97229,98943]
[null,null,20504,22564,null,null,29690,32349,25910,null,11810,34666,36823,40030,42710,45444,50980,58820,62770,63410,65803,68740,73174,76675,null,78860,80870,84067,86836,87889,90887,91680,97229,98950]
[null,null,20508,22565,null,null,29691,32350,25913,null,11820,34667,36824,40033,42718,45445,50983,58825,62772,63795,65804,68745,73175,76676,null,78862,80873,84068,86837,87890,90890,91685,97229,98951]
[null,null,20510,22566,null,null,29692,32354,25914,null,11830,34668,36825,40034,42719,45446,50984,58827,62773,63797,65805,68748,73176,76677,null,78863,80875,84069,86840,87892,90894,91686,97229,98955]
[null,null,20516,22567,null,null,29693,32360,25915,null,11840,34669,36826,40036,42723,45448,50985,58830,62774,63799,65806,68750,73177,76680,null,78864,80876,84074,86843,87893,90895,91687,97229,98959]
[null,null,20520,22600,null,null,29694,32370,25916,null,11850,34670,36827,40040,42724,45452,50986,58833,62029,63800,65807,68754,73178,76681,null,78866,80877,84075,86844,87895,90896,91688,97230,98960]
[null,null,20534,22604,null,null,29700,32376,25917,null,11860,34673,36830,40044,42725,45453,50987,58840,62030,63804,65808,68757,73180,76683,null,78868,80880,84076,86845,87896,90897,91689,97230,98961]
[null,null,20538,22605,null,null,29702,32380,25918,null,11870,34674,36833,40045,42727,45454,50990,58842,62037,63809,65810,68760,73181,76685,null,78870,80883,84080,86846,87898,90898,91690,97237,98962]
[null,null,20540,22606,null,null,29703,32389,25925,null,11910,34675,36834,40046,42728,45455,50993,58843,62038,63810,65813,68764,73185,76686,null,78873,80884,84085,86850,87900,90900,91693,97238,98965]
[null,null,20545,22607,null,null,29704,32390,25927,null,11920,34676,36835,40050,42729,45460,50994,58845,62039,63820,65814,68765,73190,76687,null,78880,80885,84086,86853,87902,90920,91694,97238,98969]
[null,null,20563,22610,null,null,29705,32398,25929,null,11930,34677,36836,40053,42730,45462,50995,58846,62040,63826,65815,68767,73191,76688,null,78883,80886,84090,86854,87903,90930,91696,97238,98970]
[null,null,20564,22614,null,null,29706,32400,25930,null,11950,34680,36837,40054,42733,45464,50996,58850,62050,63830,65819,68768,73193,76690,null,78884,80887,84093,86855,87904,90940,91697,97238,98971]
[null,null,20567,22615,null,null,29707,32401,25932,null,12000,34683,36840,40060,42740,45465,50997,58853,62057,63833,65823,68770,73194,76693,null,78885,80888,84094,86860,87905,90950,91698,97238,98972]
[null,null,20570,22616,null,null,29708,32402,25933,null,12070,34684,36843,40066,42743,45470,51000,58854,62059,63834,65826,68774,73195,76694,null,78886,80890,84100,86863,87906,90960,91699,97238,98973]
[null,null,20574,22620,null,null,29710,32403,25934,null,12080,34685,36844,40067,42745,45473,51004,58855,62060,63835,65830,68775,73200,76697,null,78887,80893,84103,86864,87907,90970,91700,97239,98974]
[null,null,20575,22624,null,null,29713,32404,25935,null,12100,34686,36845,40068,42746,45474,51005,58860,62070,63836,65833,68776,73203,76700,null,78890,80894,84104,86865,87910,90980,91708,97240,98979]
[null,null,20576,22625,null,null,29714,32405,25936,null,12110,34687,36846,40070,42747,45475,51006,58862,62076,63837,65834,68777,73204,76703,null,78893,80895,84105,86870,87911,90990,91709,97245,98980]
[null,null,11000,22626,null,null,29715,32408,25937,null,12200,34690,36847,40080,42748,45476,51007,58863,62080,63840,65835,68778,73205,76704,null,78894,80896,84106,86874,87912,null,91710,97245,98982]
[null,null,11040,22630,null,null,29716,32409,25942,null,12250,34693,36849,40083,42750,45477,51008,58864,62083,63843,65836,68780,73206,76705,null,78895,80897,84107,86875,87913,null,91712,97245,98983]
[null,null,11100,22634,null,null,29717,32410,25943,null,12300,34694,36850,40090,42752,45478,51009,58865,62084,63844,65837,68783,73210,76707,null,78896,80920,84108,86876,87914,null,91713,97246,98984]
[null,null,11200,22635,null,null,29720,32413,25944,null,12400,34695,36853,40095,42753,45479,51010,58866,62100,63845,65850,68785,73211,76708,null,78897,80923,84110,86877,87915,null,91714,97246,98985]
[null,null,11210,22636,null,null,29721,32414,25946,null,12410,34696,36854,40096,42755,45480,51013,58867,62103,63850,65880,68786,73213,76709,null,78900,80925,84113,86878,87918,null,91715,97246,98986]
[null,null,11220,22637,null,null,29722,32415,25947,null,12500,34697,36855,40097,42757,45482,51014,58868,62115,63853,65900,68790,73214,76710,null,78902,80926,84114,86880,87920,null,91716,97246,98987]
[null,null,11230,22640,null,null,29723,32416,25950,null,12600,34700,36856,40099,42760,45483,51015,58870,62116,63854,65907,68795,73215,76713,null,78903,80927,84115,86882,87922,null,91717,97246,98988]
[null,null,11240,22643,null,null,29724,32417,25952,null,12700,34703,36857,40100,42763,45484,51016,58872,62117,63856,65920,68796,73220,76714,null,78904,80928,84116,86884,87923,null,91718,97246,98990]
[null,null,11250,22644,null,null,29725,32419,25953,null,12800,34704,36858,40101,42764,45485,51017,58873,62120,63865,65936,68800,73222,76715,null,78905,80930,84117,86885,87924,null,91720,97246,98994]
[null,null,11260,22645,null,null,29729,32420,25954,null,12910,34705,36860,40102,42765,45486,51019,58874,62123,63866,65940,68801,73225,76720,null,78906,80935,84118,86886,87925,null,91726,97246,98995]
[null,null,14480,22646,null,null,29730,32422,25955,null,12920,34706,36863,40104,42766,45487,51020,58875,62130,63867,65950,68803,73226,76721,null,78908,80936,84120,86887,87926,null,91727,97246,99000]
[null,null,14490,22647,null,null,29733,32423,25956,null,12930,34707,36864,40105,42767,45488,51024,58876,62136,63870,65957,68804,73227,76722,null,78909,80940,84123,86888,87928,null,91728,97246,99010]
[null,null,14500,22650,null,null,29734,32424,25960,null,12940,34710,36865,40106,42768,45492,51025,58880,62137,63874,65958,68805,73228,76723,null,78910,80950,84124,86890,87930,null,91729,97246,99011]
[null,null,14600,22654,null,null,29735,32425,25970,null,12950,34713,36866,40109,42770,45493,51026,58881,62139,63880,66000,68806,73230,76724,null,78911,80953,84125,86892,87932,null,91730,97246,99013]
[null,null,14608,22660,null,null,29736,32427,25974,null,13000,34714,36867,40110,42771,45494,51027,58883,62140,63883,66003,68807,73232,76725,null,78914,80954,84126,86893,87933,null,91739,97246,99014]
[null,null,14609,22663,null,null,29737,32430,25975,null,13010,34715,36870,40111,42772,45495,51028,58885,62143,63885,66004,68810,73233,76726,null,78918,80955,84127,86894,87935,null,91740,97246,99020]
[null,null,14610,22664,null,null,29740,32434,25976,null,13020,34716,36873,40112,42773,45496,51029,58886,62144,63886,66005,68811,73234,76729,null,78919,80956,84130,86895,87936,null,91749,97246,99030]
[null,null,14620,22665,null,null,29744,32435,25977,null,13030,34717,36874,40113,42774,45500,51030,58887,62145,63887,66006,68812,73235,76740,null,78920,80957,84133,86896,87937,null,91750,97246,99033]
[null,null,14629,22666,null,null,29745,32437,25978,null,13040,34720,36875,40114,42775,45509,51034,58890,62150,63450,66007,68814,73236,76741,null,78923,80960,84134,86897,87938,null,91755,97246,99034]
[null,null,14630,22667,null,null,29746,32439,25980,null,13050,34723,36876,40118,42776,45510,51035,58891,62154,63453,66008,68817,73237,76743,null,78924,80963,84135,86900,87939,null,91756,97246,99036]
[null,null,14640,22700,null,null,29750,32440,25984,null,13060,34724,36877,40120,42777,45519,51036,58893,62156,63454,66009,68820,73240,76746,null,78925,80964,84136,86901,87940,null,91757,97246,99039]
[null,null,14643,22703,null,null,29753,32446,25985,null,1389,34725,36878,40130,42780,45520,51040,58894,62157,63455,66012,68821,73241,76750,null,78926,80965,84137,86902,87943,null,91758,97246,99040]
[null,null,14646,22704,null,null,29754,32448,25986,null,1400,34726,36880,40132,42783,45525,51043,58895,62159,63456,66013,68822,73242,76753,null,78927,80966,84140,86904,87945,null,91759,97246,99049]
[null,null,14647,22705,null,null,29755,32449,25987,null,1407,34727,36883,40133,42784,45527,51044,58896,62160,63457,66014,68824,73244,76754,null,78930,80967,84147,86905,87946,null,91760,97246,99050]
[null,null,14650,22706,null,null,29756,32450,25989,null,1408,34730,36884,40134,42785,45528,51045,58900,62165,63458,66017,68826,73245,76755,null,78933,81000,84150,86906,87947,null,91769,97247,99054]
[null,null,14653,22707,null,null,29759,32451,25990,null,1410,34733,36885,40137,42789,45530,51046,58905,62166,63459,66018,68827,73246,76756,null,78934,81010,84160,86907,87949,null,91770,97249,99055]
[null,null,14657,22710,null,null,29760,32452,25993,null,1419,34734,36886,40138,42790,45535,51050,58909,62170,63460,66020,68828,73247,76757,null,78935,81014,84163,86909,87950,null,91777,97249,99056]
[null,null,14658,22713,null,null,29761,32457,26000,null,1420,34735,36887,40140,42793,45540,51054,58910,62173,63463,66023,68830,73248,76773,null,78936,81015,84164,86910,87954,null,91778,97249,99060]
[null,null,14659,22715,null,null,29763,32459,26010,null,1430,34736,36888,40141,42794,45550,51055,58912,62175,63464,66024,68834,73251,76774,null,78937,81016,84165,86911,87957,null,91779,97249,99070]
[null,null,14700,22716,null,null,29764,32460,26013,null,1450,34737,36890,40142,42795,45559,51070,58913,62179,63466,66026,68837,73253,76775,null,78940,81017,84166,86912,87958,null,91780,97249,99080]
[null,null,14710,22717,null,null,29766,32469,26014,null,1460,34740,36893,40143,42796,45560,51074,58914,62180,63470,66027,68838,73255,76776,null,78943,81018,84167,86915,87960,null,91788,97249,99084]
[null,null,14720,22740,null,null,29767,32470,26015,null,1470,34743,36894,40150,42800,45567,51075,58915,62190,63480,66035,68840,73256,76780,null,78944,81020,84170,86916,87961,null,91789,97249,99089]
[null,null,14730,22744,null,null,29768,32471,26016,null,1480,34744,36895,40151,42803,45570,51076,58918,62193,63484,66036,68844,73257,76781,null,78947,81028,84173,86918,87962,null,91790,97249,99090]
[null,null,14735,22745,null,null,29770,32472,26017,null,1490,34745,36896,40152,42804,45579,51077,58919,62200,63485,66037,68846,73259,76783,null,78950,81029,84174,86919,87963,null,91799,97249,99094]
[null,null,14737,22746,null,null,29773,32500,26018,null,1500,34746,36897,40160,42805,45580,51080,58920,62203,63486,66040,68847,73260,76785,null,78953,81030,84175,86920,87964,null,91800,97249,99095]
[null,null,14738,22750,null,null,29774,32505,26020,null,1509,34747,36900,40162,42806,45588,51083,58923,62209,63487,66042,68850,73263,76786,null,78954,81040,84176,86921,87965,null,91807,97249,99099]
[null,null,14739,22753,null,null,29775,32507,26025,null,1510,34748,36903,40163,42807,45589,51084,58924,62210,63489,66043,68851,73264,76790,null,78955,81042,84177,86922,87967,null,91808,97249,99100]
[null,null,14740,22755,null,null,29776,32509,26030,null,1520,34753,36904,40164,42808,45590,51085,58925,62214,63494,66045,68854,73266,76791,null,78956,81043,84178,86923,87968,null,91809,97249,99102]
[null,null,14748,22756,null,null,29777,32510,26033,null,1530,34754,36905,40165,42809,45593,51089,58926,62215,63495,66046,68857,73270,76794,null,78957,81044,84180,86924,87969,null,91810,97249,99103]
[null,null,14749,22758,null,null,29780,32519,26034,null,1538,34755,36906,40166,42810,45594,51100,58927,62218,63496,66048,68860,73271,76795,null,78958,81045,84183,86925,87970,null,91817,97249,99104]
[null,null,14760,22760,null,null,29782,32520,26035,null,1539,34757,36907,40170,42812,45595,51104,58928,62219,63497,66050,68861,73273,76796,null,78960,81048,84184,86926,87972,null,91820,97249,99106]
[null,null,14900,22762,null,null,29783,32528,26040,null,1540,34760,36910,40171,42813,45596,51105,58930,62220,63498,66051,68865,73274,76799,null,78963,81049,84185,86927,87973,null,91826,97249,99109]
[null,null,15000,22765,null,null,29790,32530,26050,null,1548,34763,36913,40172,42814,45597,51106,58931,62226,63499,66052,68866,73275,76800,null,78964,81050,84186,86928,87974,null,91829,97249,99110]
[null,null,15010,22766,null,null,29792,32534,26060,null,1549,34764,36914,40173,42815,45598,51108,58932,62227,63500,66053,68870,73280,76803,null,78965,81060,84187,86930,87975,null,91840,97249,99113]
[null,null,15020,22767,null,null,29793,32535,26063,null,1550,34765,36915,40174,42816,45599,51109,58933,62228,63501,66054,68875,73282,76804,null,78966,81065,84190,86933,87980,null,91841,97249,99114]
[null,null,15100,22770,null,null,29794,32536,26064,null,1560,34766,36916,40180,42820,45600,51115,58935,62229,63502,66055,68877,73283,76805,null,78967,81066,84193,86934,87982,null,91850,97250,99115]
[null,null,15200,22771,null,null,29795,32537,26065,null,1566,34767,36917,40181,42823,45601,51116,58936,62230,63503,66056,68880,73284,76806,null,78968,81075,84194,86935,87983,null,91855,97250,99118]
[null,null,15210,22785,null,null,29796,32538,26068,null,1569,34768,36920,40182,42824,45602,51117,58937,null,63504,66057,68885,73285,76807,null,78970,81077,84195,86936,87984,null,91859,97255,99119]
[null,null,15220,22790,null,null,29797,32539,26069,null,1588,34770,36923,40185,42825,45604,51130,58938,null,63505,66058,68890,73286,76810,null,78973,81090,84196,86937,87985,null,91860,97255,99120]
[null,null,15230,22793,null,null,29798,32540,26070,null,1590,34773,36924,40186,42826,45605,51136,58940,null,63506,66059,68895,73288,76812,null,78974,81095,84197,86940,87986,null,91870,97255,99121]
[null,null,15240,22794,null,null,29800,32543,26073,null,1600,34774,36925,40187,42827,45606,51137,58942,null,63507,66061,68900,73289,76813,null,78975,81100,84200,86943,87988,null,91880,97255,99123]
[null,null,15250,22795,null,null,29802,32544,26080,null,1610,34775,36926,40188,42830,45607,51138,58944,null,63508,66062,68901,73298,76814,null,78976,81101,84210,86944,87990,null,91890,97255,99126]
[null,null,15260,22796,null,null,29803,32545,26083,null,1618,34776,36927,40189,42831,45608,51139,58945,null,63509,66063,68903,73299,76815,null,78977,81102,84212,86945,87993,null,91891,97256,99128]
[null,null,15270,22797,null,null,29804,32546,26085,null,1857,34777,36930,40190,42832,45609,51140,58946,null,63510,66064,68904,73300,76820,null,78978,81103,84213,86946,87994,null,91897,97256,99129]
[null,null,15280,22798,null,null,29805,32548,26086,null,1859,34780,36933,40191,42833,45610,51144,58948,null,63511,66065,68905,73301,76821,null,78979,81104,84214,86947,87995,null,91898,97256,99130]
[null,null,15290,22800,null,null,29806,32550,26088,null,1860,34782,36934,40192,42834,45613,51145,58949,null,63512,66068,68906,73302,76823,null,78980,81106,84220,86950,87996,null,91899,97256,99132]
[null,null,15300,22810,null,null,29807,32553,26089,null,1863,34783,36935,40193,42835,45615,51147,58950,null,63513,66070,68907,73303,76824,null,78983,81107,84230,86953,87997,null,91900,97256,99138]
[null,null,4040,22812,null,null,29810,32557,26090,null,1870,34785,36936,40194,42836,45618,51149,58953,null,63514,66072,68920,73304,76826,null,78984,81108,84240,86954,88000,null,91910,97256,99140]
[null,null,4100,22813,null,null,29813,32560,26092,null,1900,34787,36937,40195,42837,45619,51160,58954,null,63515,66073,68921,73305,76827,null,78985,81110,84250,86955,88009,null,91916,97256,99141]
[null,null,4120,22814,null,null,29814,32563,26093,null,1904,34788,36938,40196,42838,45620,51163,58956,null,63516,66074,68922,73306,76828,null,78986,81113,84259,86956,88020,null,91918,97256,99143]
[null,null,4200,22818,null,null,29815,32565,26094,null,2000,34790,36940,40199,42840,45623,51164,58957,null,63517,66075,68923,73307,76829,null,78987,81117,84260,86957,88030,null,91919,97256,99144]
[null,null,4210,22819,null,null,29816,32573,26095,null,2010,34793,36943,40200,42842,45625,51170,58958,null,63518,66080,68924,73308,76830,null,78990,81118,84267,86960,88040,null,91920,97256,99150]
[null,null,4230,22820,null,null,29817,32574,26096,null,2020,34794,36944,40210,42843,45626,51173,58959,null,63519,66083,68925,73309,76833,null,78993,81119,84269,86963,88060,null,91928,97260,99154]
[null,null,4240,22822,null,null,29820,32575,26099,null,2040,34795,36945,40211,42844,45627,51200,58960,null,63520,66084,68926,73310,76835,null,78994,81120,84270,86964,88070,null,91930,97260,99155]
[null,null,4250,22823,null,null,29822,32576,26110,null,2050,34800,36946,40212,42845,45628,51204,58962,null,63522,66085,68927,73312,76837,null,78995,81121,84279,86965,88100,null,91936,97260,99156]
[null,null,4260,22830,null,null,29823,32577,26114,null,2060,34803,36947,40213,42846,45629,51206,58963,null,63523,66100,68928,73313,76838,null,78996,81122,84300,86966,88105,null,91938,97260,99158]
[null,null,4300,22835,null,null,29824,32579,26119,null,2070,34804,36948,40214,42847,45630,51207,58964,null,63524,66110,68940,73314,76840,null,78997,81123,84303,86967,88110,null,91940,97260,99159]
[null,null,4310,22839,null,null,29825,32580,26120,null,2080,34805,36960,40220,42848,45638,51208,58965,null,63526,66114,68941,73315,76842,null,79000,81124,84304,86970,88120,null,91947,97260,99160]
[null,null,4318,22840,null,null,29826,32583,26133,null,2090,34806,36963,40221,42849,45640,51209,58966,null,63527,66115,68942,73316,76843,null,79010,81127,84305,86973,88123,null,91948,97260,99165]
[null,null,4320,22842,null,null,29827,32584,26137,null,2099,34810,36964,40222,42852,45641,51210,58967,null,63528,66116,68943,73317,76844,null,79019,81128,84306,86974,88124,null,91960,97267,99166]
[null,null,4330,22847,null,null,29828,32585,26140,null,2100,34813,36966,40223,42853,45643,51217,58970,null,63529,66117,68944,73318,76845,null,79020,81130,84307,86975,88125,null,91965,97268,99170]
[null,null,4340,22850,null,null,29829,32586,26170,null,2120,34816,36967,40224,42854,45644,51218,58972,null,63530,66118,68945,73319,76846,null,79023,81131,84310,86976,88126,null,91966,97268,99174]
[null,null,4360,22852,null,null,29830,32587,26172,null,2128,34820,36968,40225,42855,45645,51219,58973,null,null,66119,68946,73320,76847,null,79025,81132,84313,86977,88130,null,91968,97269,99176]
[null,null,4369,22855,null,null,29833,32590,26173,null,2129,34823,36969,40226,42858,45646,51220,58974,null,null,66120,68947,73321,76848,null,79027,81133,84314,86980,88134,null,91969,97269,99177]
[null,null,4370,22859,null,null,29834,32594,26174,null,2130,34825,36970,40227,42860,45647,51225,58975,null,null,66129,68950,73324,76849,null,79028,81134,84315,86982,88135,null,92000,97270,99178]
[null,null,4380,22860,null,null,29835,32598,26175,null,2140,34826,36973,40230,42863,45650,51226,58976,null,null,66139,68955,73325,76850,null,79030,81135,84316,86983,88136,null,92001,97277,99179]
[null,null,4390,22863,null,null,29836,32599,26176,null,2150,34830,36974,40233,42865,45653,51227,58977,null,null,66140,68957,73326,76860,null,79033,81136,84317,86984,88140,null,92002,97278,99180]
[null,null,4400,22870,null,null,29837,32600,26177,null,2160,34837,36975,40238,42866,45654,51229,58978,null,null,66145,68960,73327,76861,null,79034,81140,84320,86985,88144,null,92003,97279,99183]
[null,null,4410,22873,null,null,29840,32605,26180,null,2200,34840,36976,40239,42870,45655,51230,58980,null,null,66147,68961,73328,76862,null,79035,81141,84323,86986,88145,null,92004,97279,99185]
[null,null,4420,22879,null,null,29842,32606,26183,null,2230,34842,36977,40240,42873,45656,51237,58983,null,null,66149,68962,73329,76863,null,79036,81142,84324,86988,88146,null,92005,97280,99188]
[null,null,4440,22880,null,null,29843,32607,26184,null,2240,34843,36980,40250,42874,45659,51238,58984,null,null,66150,68963,73330,76870,null,79040,81143,84325,86989,88147,null,92006,97280,99189]
[null,null,4450,22888,null,null,29844,32609,26185,null,2250,34844,36983,40252,42875,45660,51239,58985,null,null,66160,68965,73335,76874,null,79043,81144,84326,86990,88150,null,92007,97284,99190]
[null,null,4460,22889,null,null,29845,32616,26186,null,2300,34845,36984,40253,42876,45663,51240,58986,null,null,66165,68970,73337,76875,null,79050,81147,84327,86992,88160,null,92009,97284,99192]
[null,null,4470,22890,null,null,29846,32617,26190,null,2310,34846,36985,40254,42880,45664,51245,58987,null,null,66166,68980,73338,76876,null,79058,81148,84328,86993,88170,null,92010,97285,99193]
[null,null,4480,22895,null,null,29848,32618,26196,null,2320,34847,36986,40260,42883,45665,51246,58990,null,null,66167,68987,73340,76877,null,79059,81149,84330,86994,88175,null,92012,97285,99194]
[null,null,4489,22896,null,null,29850,32620,26200,null,2330,34848,36987,40270,42884,45670,51247,58993,null,null,66168,68990,73341,76878,null,79060,81160,84333,86995,88176,null,92013,97285,99195]
[null,null,4490,22897,null,null,29851,32625,26210,null,2340,34850,36990,40272,42885,45672,51248,58994,null,null,66169,68995,73342,76879,null,79063,81161,84334,86996,88177,null,92014,97285,99196]
[null,null,4500,22898,null,null,29852,32628,26215,null,2360,34854,36993,40273,42890,45675,51260,58995,null,null,66170,68997,73343,76880,null,79064,81162,84335,86997,88179,null,92015,97285,99198]
[null,null,4510,22900,null,null,29853,32629,26220,null,2400,34855,36994,40274,42893,45676,51265,58997,null,null,66179,69000,73344,76883,null,79068,81163,84336,86998,88180,null,92016,97285,99199]
[null,null,4519,22903,null,null,29854,32630,26230,null,2410,34856,36995,40275,42894,45677,51266,59000,null,null,66180,69003,73346,76884,null,79070,81164,84340,null,88184,null,92017,97285,99200]
[null,null,4530,22904,null,null,29855,32640,26233,null,2420,34857,36996,40280,42895,45678,51267,59010,null,null,66187,69004,73348,76885,null,79080,81165,84346,null,88185,null,92018,97285,99201]
[null,null,4600,22905,null,null,29856,32647,26234,null,2440,34860,36997,40283,42900,45679,51268,59012,null,null,66188,69005,73350,76886,null,79082,81166,84347,null,88186,null,92019,97285,99202]
[null,null,4610,22906,null,null,29857,32648,26235,null,2459,34863,36998,40289,42902,45680,51270,59013,null,null,66189,69006,73353,76887,null,79083,81167,84348,null,88187,null,92020,97285,99203]
[null,null,4620,22908,null,null,29860,32649,26236,null,2460,34864,37000,40290,42903,45683,51273,59014,null,null,66190,69007,73354,76888,null,79084,81170,84349,null,88190,null,92022,97285,99206]
[null,null,4630,22909,null,null,29861,32650,26237,null,2470,34865,37004,40293,42904,45685,51274,59015,null,null,66195,69008,73355,76889,null,79085,81173,84350,null,88194,null,92023,97285,99207]
[null,null,null,22910,null,null,29862,32651,26238,null,5270,34866,37010,40300,42905,45686,51280,59020,null,null,66196,69009,73357,76890,null,79090,81174,84352,null,88195,null,92024,97285,99208]
[null,null,null,22914,null,null,29863,32652,26239,null,5280,34867,37020,40301,42906,45687,51285,59023,null,null,66197,69010,73360,76893,null,79092,81175,84360,null,88200,null,92025,97285,99209]
[null,null,null,22915,null,null,29864,32653,26240,null,5310,34873,37100,40302,42910,45690,51287,59026,null,null,66198,69011,73363,76894,null,79093,81176,84363,null,88209,null,92027,97285,99210]
[null,null,null,22920,null,null,29865,32654,26248,null,5320,34874,37104,40303,42911,45692,51300,59027,null,null,66199,69012,73364,76895,null,79094,81177,84364,null,88210,null,92030,97285,99215]
[null,null,null,22925,null,null,29866,32658,26249,null,5330,34880,37105,40305,42912,45693,51303,59028,null,null,66200,69013,73370,76896,null,79095,81178,84365,null,88220,null,92033,97285,99217]
[null,null,null,22930,null,null,29867,32659,26250,null,5348,34885,37106,40306,42913,45694,51304,59030,null,null,66210,69014,73376,76897,null,79097,81180,84366,null,88230,null,92034,97285,99220]
[null,null,null,22934,null,null,29868,32660,26260,null,5360,34887,37107,40310,42918,45696,51305,59033,null,null,66214,69015,73380,76900,null,79098,81181,84367,null,88240,null,92035,97286,99225]
[null,null,null,22937,null,null,29869,32662,26263,null,5370,34890,37108,40311,42920,45700,51310,59034,null,null,66215,69016,73385,76902,null,79100,81182,84370,null,88250,null,92036,97287,99227]
[null,null,null,22940,null,null,29870,32663,26264,null,5379,34892,37109,40312,42921,45706,51314,59035,null,null,66216,69017,73386,76903,null,79110,81183,84373,null,88260,null,92037,97288,99230]
[null,null,null,22943,null,null,29871,32664,26269,null,5400,34893,37110,40313,42923,45710,51315,59036,null,null,66217,69020,73390,76904,null,79120,81184,84374,null,88270,null,92038,97289,99231]
[null,null,null,22950,null,null,29872,32665,26270,null,5410,34894,37118,40314,42924,45712,51320,59040,null,null,66218,69021,73392,76905,null,79122,81186,84375,null,88274,null,92039,97289,99237]
[null,null,null,22951,null,null,29873,32667,26272,null,5500,34895,37119,40315,42925,45713,51323,59043,null,null,66219,69023,73395,76906,null,79130,81189,84376,null,88275,null,92040,97289,99238]
[null,null,null,22952,null,null,29874,32668,26278,null,5520,34896,37120,40316,42926,45718,51324,59044,null,null,66220,69030,73396,76907,null,79139,81190,84377,null,88276,null,92042,97290,99239]
[null,null,null,22955,null,null,29875,32670,26279,null,5530,34897,37123,40317,42928,45720,51325,59045,null,null,66224,69031,73397,76908,null,79140,81197,84380,null,88277,null,92043,97290,99240]
[null,null,null,22960,null,null,29876,32674,26280,null,5600,34898,37125,40318,42930,45723,51326,59050,null,null,66225,69032,73400,76910,null,79142,81200,84390,null,88278,null,92044,97290,99243]
[null,null,null,22964,null,null,29877,32675,26282,null,5610,34900,37128,40319,42931,45724,51340,59057,null,null,66226,69033,73401,76912,null,79143,81210,84393,null,88280,null,92045,97290,99245]
[null,null,null,22965,null,null,29878,32676,26283,null,5700,34903,37129,40320,42933,45730,51344,59058,null,null,66227,69034,73404,76915,null,79150,81215,84394,null,88283,null,92047,97295,99246]
[null,null,null,22967,null,null,29879,32677,26284,null,5710,34904,37130,40321,42934,45732,51345,59100,null,null,66228,69038,73405,76920,null,79152,81216,84395,null,88284,null,92048,97295,99247]
[null,null,null,22970,null,null,29880,32679,26288,null,5730,34905,37134,40322,42940,45737,51346,59102,null,null,66230,69040,73406,76922,null,79153,81217,84396,null,88285,null,92049,97295,99250]
[null,null,null,22973,null,null,29881,32680,26289,null,5750,34906,37138,40323,42943,45740,51350,59103,null,null,66233,69041,73407,76923,null,79160,81218,84397,null,88287,null,92050,97295,99252]
[null,null,null,22974,null,null,29883,32685,26290,null,5760,34907,37140,40325,42944,45744,51354,59104,null,null,66234,69045,73410,76924,null,79161,81220,84400,null,88289,null,92053,97295,99253]
[null,null,null,22980,null,null,29884,32688,26293,null,5780,34910,37147,40326,42945,45745,51355,59105,null,null,66235,69047,73420,76925,null,79162,81223,84403,null,88290,null,92054,97296,99254]
[null,null,null,22993,null,null,29885,32690,26299,null,6000,34913,37148,40327,42950,45746,51356,59120,null,null,66236,69050,73424,76926,null,79170,81224,84404,null,88293,null,92055,97297,99255]
[null,null,null,22994,null,null,29887,32692,26300,null,6010,34915,37149,40329,42952,45750,51357,59121,null,null,66237,69052,73425,76927,null,79180,81225,84405,null,88294,null,92056,97297,99256]
[null,null,null,22995,null,null,29888,32693,26302,null,6020,34917,37150,40330,42953,45752,51360,59122,null,null,66238,69055,73430,76928,null,79182,81226,84406,null,88295,null,92060,97297,99257]
[null,null,null,22997,null,null,29890,32694,26304,null,6030,34920,37156,40333,42954,45753,51364,59124,null,null,66239,69057,73431,76930,null,79183,81227,84407,null,88296,null,92062,97297,99258]
[null,null,null,null,null,null,29891,32695,26305,null,6040,34923,37157,40334,42955,45754,51366,59125,null,null,66240,69059,73433,76950,null,79190,81228,84415,null,88298,null,92063,97297,99259]
[null,null,null,null,null,null,29894,32696,26308,null,6050,34926,37160,40335,42956,45755,51367,59126,null,null,66244,69060,73434,76951,null,79200,81229,84427,null,88299,null,92064,97297,99260]
[null,null,null,null,null,null,29895,32697,26309,null,6060,34927,37168,40336,42957,45756,51370,59140,null,null,66245,69062,73435,76952,null,79202,81230,84440,null,88300,null,92065,97298,99270]
[null,null,null,null,null,null,29896,32698,26310,null,6070,34930,37170,40337,42960,45757,51373,59143,null,null,66246,69063,73436,76953,null,79203,81233,84445,null,88302,null,92066,97298,99273]
[null,null,null,null,null,null,29897,32699,26315,null,6080,34933,37178,40338,42963,45758,51374,59144,null,null,66247,69064,73437,76955,null,79204,81234,84446,null,88303,null,92072,97298,99275]
[null,null,null,null,null,null,29898,32702,26320,null,6090,34934,37179,40340,42964,45760,51375,59146,null,null,66249,69065,73438,76956,null,79205,81235,84447,null,88304,null,92073,97298,99277]
[null,null,null,null,null,null,29900,32703,26328,null,6100,34935,37180,40341,42965,45763,51380,59150,null,null,66250,69070,73440,76957,null,79206,81236,84450,null,88305,null,92074,97298,99278]
[null,null,null,null,null,null,29902,32704,26340,null,6140,34936,37187,40342,42967,45764,51383,59154,null,null,66254,69080,73450,76958,null,79207,81237,84459,null,88306,null,92075,97299,99279]
[null,null,null,null,null,null,29903,32720,26342,null,6170,34937,37188,40347,42970,45765,51384,59155,null,null,66256,69090,73453,76963,null,79208,81238,84460,null,88307,null,92076,97302,99280]
[null,null,null,null,null,null,29904,32721,26343,null,6200,34940,37189,40348,42975,45766,51385,59160,null,null,66257,69091,73454,76964,null,79210,81240,84480,null,88310,null,92077,97302,99283]
[null,null,null,null,null,null,29905,32722,26344,null,6220,34942,37190,40350,42976,45767,51386,59163,null,null,66259,69092,73455,76965,null,79213,81245,84483,null,88321,null,92078,97302,99284]
[null,null,null,null,null,null,29906,32724,26345,null,6240,34945,37199,40351,42977,45770,51390,59164,null,null,66260,69093,73456,76970,null,79214,81247,84484,null,88330,null,92079,97302,99286]
[null,null,null,null,null,null,29907,32725,26346,null,6250,34946,37200,40352,42978,45773,51393,59165,null,null,66263,69094,73457,76973,null,79215,81248,84485,null,88335,null,92080,97302,99287]
[null,null,null,null,null,null,29908,32730,26348,null,6270,34947,37204,40355,42980,45774,51400,59167,null,null,66265,69100,73460,76974,null,79216,81249,84486,null,88336,null,92083,97302,99288]
[null,null,null,null,null,null,29910,32740,26350,null,6280,34948,37205,40360,42982,45775,51410,59168,null,null,66266,69101,73464,76975,null,79217,81250,84490,null,88338,null,92084,97302,99293]
[null,null,null,null,null,null,29912,32741,26356,null,6300,34950,37207,40362,42985,45776,51412,59170,null,null,66267,69104,73466,76976,null,79218,81254,84493,null,88340,null,92085,97302,99300]
[null,null,null,null,null,null,29913,32742,26360,null,6350,34953,37208,40363,42986,45777,51413,59173,null,null,66268,69105,73467,76980,null,79219,81255,84494,null,88346,null,92086,97302,99310]
[null,null,null,null,null,null,29914,32743,26363,null,6400,34954,37209,40364,42987,45780,51414,59175,null,null,66270,69106,73468,76981,null,79220,81256,84495,null,88349,null,92090,97302,99311]
[null,null,null,null,null,null,29915,32750,26365,null,6430,34955,37210,40370,42988,45783,51415,59180,null,null,66273,69110,73470,76983,null,79224,81257,84496,null,88350,null,92092,97302,99312]
[null,null,null,null,null,null,29916,32754,26366,null,6450,34956,37217,40371,42990,45784,51416,59183,null,null,66274,69120,73471,76984,null,79225,81259,84500,null,88370,null,92093,97302,99313]
[null,null,null,null,null,null,29917,32758,26370,null,6470,34957,37218,40373,42992,45785,51417,59184,null,null,66275,69123,73473,76985,null,79226,81260,84503,null,88372,null,92094,97302,99314]
[null,null,null,null,null,null,29918,32760,26380,null,6500,34960,37219,40374,42993,45786,51418,59185,null,null,66276,69124,73474,76990,null,79227,81263,84504,null,88373,null,92095,97302,99315]
[null,null,null,null,null,null,29919,32765,26383,null,6600,34963,37220,40376,42994,45787,51422,59186,null,null,66277,69126,73475,76992,null,79228,81265,84505,null,88374,null,92096,97302,99316]
[null,null,null,null,null,null,29920,32767,26384,null,6700,34964,37225,40380,42995,45788,51423,59187,null,null,66278,69127,73476,76993,null,79229,81270,84506,null,88390,null,92100,97302,99320]
[null,null,null,null,null,null,29921,32770,26400,null,6720,34965,37227,40381,43000,45789,51424,59190,null,null,66279,69130,73477,76994,null,79230,81271,84507,null,88400,null,92103,97302,99322]
[null,null,null,null,null,null,29922,32774,26401,null,7183,34966,37230,40382,43001,45790,51425,59193,null,null,66280,69139,73480,76995,null,79233,81277,84510,null,88402,null,92104,97302,99323]
[null,null,null,null,null,null,29923,32776,26405,null,7187,34967,37233,40383,43002,45796,51426,59194,null,null,66285,69140,73482,76997,null,79234,81278,84513,null,88403,null,92105,97302,99330]
[null,null,null,null,null,null,29925,32777,26406,null,7188,34968,37234,40387,43003,45798,51427,59195,null,null,66286,69145,73483,76998,null,79235,81280,84514,null,88404,null,92107,97302,99340]
[null,null,null,null,null,null,29926,32780,26409,null,7189,34970,37235,40390,43004,45799,51428,59200,null,null,66287,69150,73486,null,null,79236,81285,84515,null,88405,null,92108,97302,99342]
[null,null,null,null,null,null,29930,32783,26410,null,7190,34973,37236,40391,43005,45800,51430,59203,null,null,66290,69154,73490,null,null,79237,81289,84516,null,88406,null,92110,97302,99343]
[null,null,null,null,null,null,29932,32785,26411,null,7199,34974,37237,40392,43006,45802,51432,59204,null,null,66295,69158,73493,null,null,79240,81290,84517,null,88407,null,92113,97302,99344]
[null,null,null,null,null,null,29935,32789,26412,null,7200,34975,37238,40394,43010,45803,51433,59205,null,null,66296,69160,73495,null,null,79243,81293,84520,null,88408,null,92114,97302,99350]
[null,null,null,null,null,null,29936,32790,26415,null,7207,34976,37239,40395,43011,45804,51434,59206,null,null,66297,69170,73500,null,null,79244,81294,84523,null,88410,null,92116,97302,99352]
[null,null,null,null,null,null,29937,32793,26416,null,7209,34977,37240,40396,43014,45805,51435,59210,null,null,66350,69171,73502,null,null,79245,81295,84524,null,88412,null,92117,97302,99353]
[null,null,null,null,null,null,29938,32794,26420,null,7210,34978,37249,40397,43015,45806,51436,59220,null,null,66353,69180,73503,null,null,79246,81300,84525,null,88415,null,92120,97302,99360]
[null,null,null,null,null,null,29939,32797,26423,null,7214,34980,37250,40398,43016,45810,51437,59230,null,null,66354,69183,73504,null,null,79247,81303,84526,null,88420,null,92122,97302,99362]
[null,null,null,null,null,null,29940,32800,26429,null,7220,34983,37257,40400,43017,45811,51440,59233,null,null,66356,69190,73505,null,null,79250,81304,84527,null,88425,null,92123,97303,99363]
[null,null,null,null,null,null,29942,32811,26431,null,7224,34984,37258,40402,43018,45812,51442,59234,null,null,66357,69193,73506,null,null,79253,81305,84530,null,88430,null,92124,97303,99370]
[null,null,null,null,null,null,29943,32812,26435,null,7230,34985,37259,40403,43019,45815,51443,59235,null,null,66358,69200,73507,null,null,79254,81306,84533,null,88434,null,92125,97303,99379]
[null,null,null,null,null,null,29944,32813,26450,null,7239,34986,37260,40404,43020,45816,51445,59237,null,null,66359,69201,73509,null,null,79255,81307,84534,null,88439,null,92126,97303,99380]
[null,null,null,null,null,null,29945,32814,26452,null,7240,34987,37266,40405,43021,45820,51446,59240,null,null,66360,69202,73510,null,null,79256,81308,84535,null,88440,null,92127,97304,99382]
[null,null,null,null,null,null,29946,32815,26453,null,7250,34988,37267,40406,43022,45822,51453,59243,null,null,66362,69203,73514,null,null,79257,81310,84536,null,88442,null,92130,97304,99390]
[null,null,null,null,null,null,29947,32816,26460,null,7259,34990,37268,40407,43023,45825,51454,59244,null,null,66363,69204,73515,null,null,79260,81311,84560,null,88443,null,92131,97305,99392]
[null,null,null,null,null,null,29948,32818,26463,null,7268,34993,37269,40408,43024,45830,51455,59250,null,null,66364,69205,73516,null,null,79263,81312,84563,null,88444,null,92133,97305,99393]
[null,null,null,null,null,null,29949,32820,26464,null,7270,34994,37270,40409,43025,45840,51456,59253,null,null,66365,69206,73517,null,null,79264,81315,84564,null,88446,null,92135,97305,99400]
[null,null,null,null,null,null,29950,32830,26465,null,7279,34995,37276,40410,43029,45850,51457,59254,null,null,66366,69207,73518,null,null,79265,81316,84565,null,88447,null,92138,97305,99403]
[null,null,null,null,null,null,29952,32840,26467,null,7280,34996,37277,40412,43030,45857,51458,59256,null,null,66367,69209,73520,null,null,79266,81317,84566,null,88448,null,92140,97305,99406]
[null,null,null,null,null,null,29953,32845,26470,null,7290,34997,37278,40413,43033,45860,51459,59257,null,null,66368,69210,73523,null,null,79267,81318,84567,null,88449,null,92142,97305,99410]
[null,null,null,null,null,null,29954,32847,26477,null,7300,35000,37279,40414,43034,45870,51462,59258,null,null,66369,69211,73530,null,null,79270,81320,84573,null,88450,null,92143,97305,99420]
[null,null,null,null,null,null,29955,32850,26485,null,7310,35010,37280,40415,43035,45875,51463,59262,null,null,66370,69214,73537,null,null,79273,81323,84575,null,88455,null,92144,97305,99423]
[null,null,null,null,null,null,29956,32853,26486,null,7320,35013,37287,40416,43036,45876,51464,59263,null,null,66373,69220,73538,null,null,79274,81324,84576,null,88456,null,92145,97305,99424]
[null,null,null,null,null,null,29957,32854,26500,null,7330,35014,37288,40417,43037,45877,51465,59264,null,null,66374,69223,73539,null,null,79275,81325,84580,null,88459,null,92146,97305,99427]
[null,null,null,null,null,null,29958,32880,26506,null,7340,35015,37289,40418,43038,45880,51466,59265,null,null,66375,69230,73540,null,null,79276,81326,84583,null,88460,null,92147,97305,99430]
[null,null,null,null,null,null,29959,32882,26507,null,7350,35016,37290,40420,43039,45883,51467,59266,null,null,66376,69231,73543,null,null,79277,81330,84600,null,88468,null,92148,97305,99433]
[null,null,null,null,null,null,29960,32883,26510,null,7359,35017,37293,40421,43040,45884,51468,59267,null,null,66377,69233,73550,null,null,79280,81333,84601,null,88469,null,92150,97305,99434]
[null,null,null,null,null,null,29962,32884,26513,null,7360,35018,37294,40422,43041,45887,51470,59280,null,null,66378,69235,73554,null,null,79283,81334,84602,null,88470,null,92153,97305,99436]
[null,null,null,null,null,null,29963,32885,26514,null,7369,35019,37295,40423,43042,45890,51475,59283,null,null,66380,69240,73556,null,null,79284,81335,84603,null,88473,null,92154,97305,99440]
[null,null,null,null,null,null,29964,32886,26515,null,7370,35020,37296,40424,43043,45896,51476,59284,null,null,66384,69241,73557,null,null,79285,81336,84607,null,88479,null,92159,97305,99442]
[null,null,null,null,null,null,29965,32887,26516,null,7380,35023,37297,40425,43044,45899,51477,59285,null,null,66390,69243,73560,null,null,79286,81337,84610,null,88480,null,92161,97305,99443]
[null,null,null,null,null,null,29966,32888,26517,null,7400,35024,37298,40426,43045,45900,51479,59286,null,null,66400,69244,73563,null,null,79287,81340,84611,null,88490,null,92163,97305,99444]
[null,null,null,null,null,null,29967,32889,26520,null,7410,35025,37299,40428,43046,45902,51480,59290,null,null,66410,69248,73564,null,null,79290,81341,84615,null,88500,null,92164,97305,99447]
[null,null,null,null,null,null,29968,32890,26524,null,7420,35026,37300,40429,43047,45903,51483,59295,null,null,66413,69249,73565,null,null,79292,81343,84617,null,88509,null,92170,97305,99454]
[null,null,null,null,null,null,29969,32891,26525,null,7430,35027,37306,40430,43050,45905,51484,59296,null,null,66414,69250,73566,null,null,79293,81344,84620,null,88510,null,92173,97305,99455]
[null,null,null,null,null,null,29970,32893,26526,null,7440,35028,37310,40431,43051,45906,51485,59297,null,null,66415,69252,73570,null,null,79294,81345,84622,null,88520,null,92182,97305,99456]
[null,null,null,null,null,null,29971,32894,26530,null,7450,35029,37315,40436,43052,45907,51486,59300,null,null,66417,69253,73572,null,null,79296,81346,84623,null,88522,null,92183,97305,99457]
[null,null,null,null,null,null,29972,32895,26532,null,7455,35030,37316,40440,43053,45908,51500,59310,null,null,66418,69254,73573,null,null,79297,81349,84624,null,88540,null,92184,97305,99458]
[null,null,null,null,null,null,29973,32896,26533,null,7456,35039,37317,40441,43054,45920,51510,59319,null,null,66420,69255,73575,null,null,79300,81350,84630,null,88550,null,92185,97306,99460]
[null,null,null,null,null,null,29974,32897,26534,null,7460,35040,37318,40444,43055,45922,51513,59320,null,null,66422,69257,73576,null,null,79303,81351,84633,null,88560,null,92186,97306,99466]
[null,null,null,null,null,null,29977,32900,26540,null,7469,35043,37319,40450,43056,45925,51514,59330,null,null,66423,69260,73579,null,null,79304,81353,84634,null,88570,null,92190,97306,99467]
[null,null,null,null,null,null,29980,32902,26543,null,7470,35044,37320,40451,43059,45930,51515,59334,null,null,66424,69262,73580,null,null,79305,81360,84635,null,88580,null,92200,97306,99468]
[null,null,null,null,null,null,29982,32903,26544,null,7480,35045,37327,40453,43060,45933,51516,59335,null,null,66425,69265,73581,null,null,79306,81361,84636,null,88589,null,92203,97306,99469]
[null,null,null,null,null,null,29983,32907,26545,null,7500,35046,37328,40460,43061,45934,51517,59340,null,null,66427,69266,73583,null,null,79307,81363,84637,null,88595,null,92204,97307,99471]
[null,null,null,null,null,null,29984,32910,26546,null,7509,35047,37330,40461,43062,45935,51518,59349,null,null,66428,69267,73584,null,null,79313,81364,84640,null,88596,null,92205,97307,99473]
[null,null,null,null,null,null,29985,32912,26547,null,9660,35048,37340,40463,43063,45936,51523,59350,null,null,66430,69268,73585,null,null,79314,81367,84650,null,88597,null,92206,97307,99474]
[null,null,null,null,null,null,29986,32913,26550,null,9670,35049,37350,40464,43064,45940,51524,59359,null,null,66434,69270,73586,null,null,79315,81369,84653,null,88598,null,92207,97308,99476]
[null,null,null,null,null,null,29990,32914,26553,null,9680,35050,37353,40465,43065,45943,51525,59360,null,null,66435,69273,73587,null,null,79316,81370,84654,null,88599,null,92210,97308,99478]
[null,null,null,null,null,null,29993,32917,26554,null,9689,35054,37355,40466,43066,45944,51526,59363,null,null,66436,69280,73588,null,null,79317,81372,84655,null,88600,null,92213,97308,99479]
[null,null,null,null,null,null,29994,32918,26555,null,9690,35055,37357,40469,43067,45945,51527,59370,null,null,66437,69282,73589,null,null,79318,81373,84656,null,88610,null,92214,97308,99480]
[null,null,null,null,null,null,29995,32920,26556,null,9696,35057,37358,40470,43068,45946,51530,59373,null,null,66438,69287,73590,null,null,79320,81374,84657,null,88614,null,92215,97309,99483]
[null,null,null,null,null,null,29997,32925,26557,null,9698,35058,37359,40471,43070,45950,51533,59374,null,null,66440,69290,73591,null,null,79323,81375,84660,null,88615,null,92216,97310,99484]
[null,null,null,null,null,null,30000,32930,26563,null,9700,35059,37360,40472,43072,45954,51534,59375,null,null,66444,69291,73592,null,null,79324,81376,84670,null,88620,null,92217,97312,99500]
[null,null,null,null,null,null,30010,32932,26564,null,9704,35060,37364,40473,43075,45955,51535,59376,null,null,66445,69292,73593,null,null,79325,81377,84673,null,88630,null,92220,97312,99504]
[null,null,null,null,null,null,30013,32933,26565,null,9705,35064,37366,40474,43076,45956,51536,59377,null,null,66446,69293,73594,null,null,79326,81378,84674,null,88631,null,92223,97312,99505]
[null,null,null,null,null,null,30015,32934,26566,null,9706,35065,37368,40476,43077,45957,51537,59379,null,null,66447,69296,73595,null,null,79327,81379,84675,null,88632,null,92225,97312,99506]
[null,null,null,null,null,null,30017,32939,26567,null,9708,35066,37369,40477,43078,45959,51540,59380,null,null,66448,69300,73596,null,null,79330,81380,84676,null,88640,null,92226,97312,99510]
[null,null,null,null,null,null,30018,32940,26570,null,9709,35067,37380,40479,43080,45960,51543,59384,null,null,66449,69302,73597,null,null,79333,81383,84677,null,88649,null,92227,97314,99520]
[null,null,null,null,null,null,30019,32944,26573,null,9710,35068,37390,40480,43084,45961,51544,59386,null,null,66450,69304,73598,null,null,79334,81384,84680,null,88650,null,92230,97314,99523]
[null,null,null,null,null,null,30020,32945,26574,null,9720,35069,37399,40482,43085,45963,51550,59387,null,null,66455,69305,73600,null,null,79335,81386,84683,null,88651,null,92234,97314,99530]
[null,null,null,null,null,null,30023,32947,26575,null,9730,35070,37400,40483,43086,45964,51553,59389,null,null,66456,69307,73610,null,null,79336,81390,84690,null,88653,null,92240,97314,99540]
[null,null,null,null,null,null,30028,32948,26577,null,9740,35073,37407,40485,43087,45965,51554,59390,null,null,66457,69310,73611,null,null,79337,81393,84693,null,88654,null,92256,97314,99542]
[null,null,null,null,null,null,30029,32949,26580,null,9750,35074,37408,40486,43089,45967,51555,59392,null,null,66458,69312,73613,null,null,79340,81400,84694,null,88655,null,92257,97314,99543]
[null,null,null,null,null,null,30030,32950,26584,null,9760,35075,37410,40487,43090,45970,51556,59393,null,null,66459,69313,73614,null,null,79343,81410,84695,null,88656,null,92259,97314,99544]
[null,null,null,null,null,null,30033,32951,26590,null,9769,35076,37414,40488,43091,45975,51557,59400,null,null,66460,69314,73615,null,null,79344,81413,84700,null,88660,null,92268,97314,99545]
[null,null,null,null,null,null,30034,32952,26593,null,9770,35077,37415,40489,43092,45976,51558,59410,null,null,66463,69320,73620,null,null,79345,81420,84703,null,88670,null,92270,97314,99546]
[null,null,null,null,null,null,30036,32953,26595,null,9780,35078,37416,40490,43093,45977,51559,59414,null,null,66464,69321,73621,null,null,79346,81426,84705,null,88680,null,92280,97314,99547]
[null,null,null,null,null,null,30037,32955,26596,null,9790,35079,37417,40491,43094,45978,51560,59415,null,null,66465,69324,73625,null,null,79347,81427,84709,null,88684,null,92290,97314,99550]
[null,null,null,null,null,null,30038,32957,26600,null,9800,35080,37419,40494,43095,45979,51564,59420,null,null,66466,69325,73630,null,null,79350,81429,84710,null,88687,null,92293,97314,99552]
[null,null,null,null,null,null,30039,32958,26603,null,9810,35090,37420,40496,43096,45980,51565,59423,null,null,66468,69330,73631,null,null,79353,81430,84711,null,88689,null,92300,97314,99559]
[null,null,null,null,null,null,30040,32980,26604,null,9819,35099,37425,40497,43097,45982,51566,59424,null,null,66469,69333,73633,null,null,79354,81440,84730,null,88690,null,92310,97314,99560]
[null,null,null,null,null,null,30043,32985,26605,null,9820,35100,37426,40498,43098,45983,51568,59425,null,null,66470,69340,73635,null,null,79355,81448,84743,null,88700,null,92320,97314,99563]
[null,null,null,null,null,null,30060,32992,26606,null,9828,35101,37427,40500,43099,45984,51569,59426,null,null,66473,69345,73637,null,null,79356,81450,84744,null,88703,null,92330,97314,99570]
[null,null,null,null,null,null,30063,32994,26607,null,9829,35102,37428,40502,43100,45986,51570,59427,null,null,66475,69346,73638,null,null,79357,81460,84745,null,88706,null,92340,97314,99573]
[null,null,null,null,null,null,30064,32995,26610,null,9830,35103,37430,40503,43101,45987,51572,59428,null,null,66476,69350,73640,null,null,79360,81469,84746,null,88707,null,92350,97314,99575]
[null,null,null,null,null,null,30065,32996,26613,null,9837,35104,37433,40505,43103,45988,51573,59430,null,null,66477,69355,73644,null,null,79363,81470,84747,null,88708,null,92360,97314,99580]
[null,null,null,null,null,null,30067,32997,26614,null,10370,35105,37434,40506,43104,45990,51574,59433,null,null,66478,69360,73645,null,null,79364,81474,84750,null,88709,null,92370,97314,99581]
[null,null,null,null,null,null,30068,32998,26616,null,10378,35106,37436,40507,43106,45992,51575,59434,null,null,66479,69361,73647,null,null,79365,81475,84754,null,88710,null,92380,97314,99583]
[null,null,null,null,null,null,30069,33000,26617,null,10379,35107,37438,40508,43108,45993,51576,59435,null,null,66480,69366,73650,null,null,79366,81476,84760,null,88713,null,92385,97314,99584]
[null,null,null,null,null,null,30070,33010,26620,null,10380,35108,37439,40509,43109,45994,51577,59436,null,null,66482,69369,73654,null,null,79370,81477,84770,null,88715,null,92389,97314,99585]
[null,null,null,null,null,null,30073,33013,26623,null,10400,35109,37440,40510,43110,45995,51578,59438,null,null,66484,69370,73655,null,null,79373,81478,84775,null,88720,null,92390,97314,99590]
[null,null,null,null,null,null,30074,33014,26624,null,10500,35110,37443,40511,43111,45996,51579,59440,null,null,66485,69375,73656,null,null,79374,81479,84790,null,88727,null,92400,97314,99592]
[null,null,null,null,null,null,30075,33016,26625,null,10580,35111,37444,40512,43112,45997,51580,59443,null,null,66486,69380,73657,null,null,79375,81480,84800,null,88729,null,92403,97314,99593]
[null,null,null,null,null,null,30076,33017,26626,null,10600,35112,37446,40513,43113,45998,51582,59444,null,null,66488,69390,73658,null,null,79376,81489,84806,null,88730,null,92404,97314,99598]
[null,null,null,null,null,null,30077,33018,26627,null,10610,35113,37448,40514,43114,46000,51583,59445,null,null,66489,69394,73659,null,null,79377,81490,84820,null,88733,null,92405,97314,99600]
[null,null,null,null,null,null,30078,33019,26630,null,10620,35114,37450,40515,43120,46002,51584,59446,null,null,66490,69400,73660,null,null,79380,81493,84824,null,88734,null,92406,97314,99602]
[null,null,null,null,null,null,30090,33020,26634,null,10630,35115,37455,40516,43121,46003,51585,59447,null,null,66494,69401,73661,null,null,79382,81500,84830,null,88735,null,92407,97314,99603]
[null,null,null,null,null,null,30093,33023,26635,null,10640,35117,37456,40517,43123,46005,51586,59450,null,null,66495,69402,73663,null,null,79383,81504,84850,null,88736,null,92409,97315,99605]
[null,null,null,null,null,null,30096,33029,26636,null,10660,35118,37457,40518,43124,46006,51587,59451,null,null,66496,69403,73665,null,null,79384,81510,84860,null,88737,null,92410,97315,99606]
[null,null,null,null,null,null,30099,33030,26637,null,10700,35119,37458,40520,43125,46007,51588,59453,null,null,66499,69404,73666,null,null,79385,81513,84863,null,88740,null,92412,97315,99607]
[null,null,null,null,null,null,30100,33038,26640,null,10710,35120,37459,40521,43126,46008,51590,59454,null,null,66550,69405,73667,null,null,79386,81520,84864,null,88745,null,92415,97315,99608]
[null,null,null,null,null,null,30101,33039,26643,null,10800,35121,37460,40522,43127,46009,51598,59455,null,null,66553,69406,73670,null,null,79387,81523,84865,null,88746,null,92417,97315,99609]
[null,null,null,null,null,null,30102,33040,26646,null,10810,35123,37468,40523,43130,46010,51599,59460,null,null,66556,69407,73674,null,null,79390,81524,84874,null,88747,null,92419,97315,99613]
[null,null,null,null,null,null,30103,33050,26650,null,10820,35125,37470,40528,43131,46012,51600,59463,null,null,66563,69408,73680,null,null,79393,81525,84880,null,88748,null,92420,97315,99615]
[null,null,null,null,null,null,30104,33058,26659,null,10830,35127,37477,40531,43132,46013,51603,59464,null,null,66580,69409,73681,null,null,79394,81530,84890,null,88749,null,92430,97315,99616]
[null,null,null,null,null,null,30105,33059,26670,null,10840,35128,37478,40532,43135,46014,51604,59466,null,null,66583,69410,73683,null,null,79395,81533,84893,null,88750,null,92435,97315,99618]
[null,null,null,null,null,null,30106,33060,26690,null,10900,35129,37479,40533,43138,46015,51605,59467,null,null,66600,69411,73684,null,null,79396,81535,84894,null,88754,null,92436,97315,99620]
[null,null,null,null,null,null,30107,33063,26695,null,10910,35130,37480,40534,43139,46017,51606,59470,null,null,66603,69412,73685,null,null,79397,81540,84895,null,88755,null,92440,97315,99622]
[null,null,null,null,null,null,30108,33065,26700,null,10920,35132,37487,40535,43140,46018,51607,59472,null,null,66604,69420,73686,null,null,79400,81543,84900,null,88756,null,92443,97315,99623]
[null,null,null,null,null,null,30109,33066,26710,null,10926,35133,37490,40537,43141,46019,51610,59473,null,null,66605,69421,73687,null,null,79401,81544,84903,null,88757,null,92444,97315,99624]
[null,null,null,null,null,null,30110,33067,26719,null,11000,35134,37500,40538,43142,46020,51613,59474,null,null,66606,69430,73688,null,null,79406,81545,84905,null,88758,null,92445,97315,99625]
[null,null,null,null,null,null,30111,33068,26720,null,11040,35135,37510,40539,43143,46022,51614,59475,null,null,66607,69440,73689,null,null,79407,81600,84906,null,88759,null,92448,97315,99626]
[null,null,null,null,null,null,30115,33069,26729,null,11100,35136,37520,40540,43144,46023,51620,59476,null,null,66609,69449,73690,null,null,79408,81605,84907,null,88760,null,92450,97315,99630]
[null,null,null,null,null,null,30116,33070,26730,null,11200,35137,37526,40541,43145,46024,51623,59478,null,null,66610,69450,73691,null,null,79410,81607,84910,null,88763,null,92454,97316,99634]
[null,null,null,null,null,null,30120,33076,26736,null,11210,35138,37530,40542,43146,46025,51624,59480,null,null,66612,69453,73692,null,null,79413,81610,84911,null,88764,null,92456,97316,99635]
[null,null,null,null,null,null,30121,33077,26737,null,11220,35139,37536,40544,43147,46029,51633,59481,null,null,66613,69457,73693,null,null,79420,81613,84918,null,88769,null,92470,97316,99640]
[null,null,null,null,null,null,30123,33078,26739,null,11230,35140,37538,40547,43150,46030,51634,59482,null,null,66614,69460,73694,null,null,79421,81620,84919,null,88770,null,92475,97320,99644]
[null,null,null,null,null,null,30124,33080,26740,null,11240,35141,37539,40548,43151,46034,51635,59490,null,null,66616,69470,73697,null,null,79427,81621,84920,null,88776,null,92480,97320,99650]
[null,null,null,null,null,null,30125,33084,26741,null,11250,35143,37544,40549,43153,46036,51636,59493,null,null,66620,69472,73698,null,null,79428,81622,84923,null,88777,null,92483,97320,99654]
[null,null,null,null,null,null,30126,33085,26747,null,11260,35144,37545,40550,43154,46037,51637,59494,null,null,66623,69473,73700,null,null,79429,81623,84924,null,88778,null,92486,97320,99655]
[null,null,null,null,null,null,30127,33086,26748,null,14269,35146,37547,40551,43155,46040,51640,59497,null,null,66626,69474,73702,null,null,79430,81624,84925,null,88779,null,92487,97320,99656]
[null,null,null,null,null,null,30128,33087,26749,null,14270,35147,37548,40552,43156,46042,51644,59498,null,null,66627,69480,73703,null,null,79431,81625,84928,null,88780,null,92488,97320,99670]
[null,null,null,null,null,null,30129,33088,26750,null,14275,35150,37549,40553,43157,46043,51645,59500,null,null,66628,69485,73720,null,null,79432,81630,84929,null,88783,null,92490,97320,99673]
[null,null,null,null,null,null,30130,33089,26759,null,14300,35153,37550,40560,43159,46044,51646,59503,null,null,66629,69490,73721,null,null,79433,81632,84930,null,88784,null,92495,97320,99674]
[null,null,null,null,null,null,30133,33090,26760,null,14308,35154,37555,40561,43160,46045,51647,59504,null,null,66630,69492,73722,null,null,79434,81635,84933,null,88785,null,92497,97320,99675]
[null,null,null,null,null,null,30134,33093,26763,null,14310,35155,37557,40562,43161,46047,51650,59505,null,null,66632,69500,73723,null,null,79435,81639,84934,null,88786,null,92500,97320,99678]
[null,null,null,null,null,null,30135,33100,26764,null,14320,35156,37560,40563,43162,46049,51653,59506,null,null,66633,69501,73724,null,null,79436,81640,84935,null,88787,null,92503,97320,99680]
[null,null,null,null,null,null,30136,33103,26765,null,14325,35157,37564,40568,43163,46050,51654,59507,null,null,66634,69502,73725,null,null,79437,81642,84940,null,88788,null,92504,97320,99684]
[null,null,null,null,null,null,30137,33104,26766,null,14326,35158,37566,40570,43164,46053,51655,59508,null,null,66635,69503,73726,null,null,79440,81644,84943,null,88789,null,92505,97320,99685]
[null,null,null,null,null,null,30140,33105,26768,null,14330,35159,37570,40571,43165,46055,51670,59510,null,null,66636,69504,73730,null,null,79442,81649,84944,null,88790,null,92510,97320,99686]
[null,null,null,null,null,null,30143,33106,26769,null,14340,35160,37590,40572,43167,46056,51673,59512,null,null,66637,69507,73732,null,null,79443,81650,84945,null,88793,null,92513,97320,99687]
[null,null,null,null,null,null,30145,33107,26770,null,14350,35163,37600,40573,43168,46057,51674,59513,null,null,66640,69508,73734,null,null,79444,81652,84950,null,88794,null,92514,97320,99689]
[null,null,null,null,null,null,30146,33108,26779,null,14357,35164,37603,40574,43170,46060,51675,59514,null,null,66643,69509,73735,null,null,79445,81653,84953,null,88795,null,92515,97320,99700]
[null,null,null,null,null,null,30147,33110,26780,null,14360,35165,37604,40580,43172,46063,51676,59515,null,null,66644,69510,73736,null,null,79446,81654,84954,null,88796,null,92516,97324,99703]
[null,null,null,null,null,null,30148,33113,26788,null,14370,35166,37605,40581,43174,46064,51680,59516,null,null,66645,69512,73737,null,null,79447,81655,84955,null,88797,null,92517,97330,99704]
[null,null,null,null,null,null,30149,33114,26790,null,14376,35167,37606,40582,43175,46065,51690,59517,null,null,66646,69513,73738,null,null,79450,81660,84957,null,88798,null,92518,97334,99705]
[null,null,null,null,null,null,30150,33115,26799,null,14377,35168,37610,40583,43176,46066,51693,59518,null,null,66647,69516,73739,null,null,79460,81661,84960,null,88799,null,92519,97336,99707]
[null,null,null,null,null,null,30151,33116,26800,null,14380,35169,37611,40584,43177,46067,51694,59520,null,null,66648,69519,73740,null,null,79466,81663,84969,null,88800,null,92520,97336,99709]
[null,null,null,null,null,null,30152,33117,26809,null,14386,35170,37613,40585,43179,46068,51695,59523,null,null,66649,69520,73742,null,null,79467,81664,84980,null,88803,null,92523,97336,99710]
[null,null,null,null,null,null,30153,33120,26810,null,14387,35171,37614,40586,43180,46069,51696,59524,null,null,66650,69524,73743,null,null,79470,81666,84984,null,88808,null,92524,97337,99713]
[null,null,null,null,null,null,30154,33123,26813,null,14388,35173,37615,40590,43183,46070,51697,59525,null,null,66653,69526,73746,null,null,79471,81670,84987,null,88809,null,92525,97340,99715]
[null,null,null,null,null,null,30155,33124,26820,null,14389,35174,37616,40591,43184,46072,51700,59526,null,null,66655,69530,73747,null,null,79480,81675,84988,null,88810,null,92527,97342,99720]
[null,null,null,null,null,null,30160,33125,26825,null,14390,35175,37620,40592,43185,46073,51704,59527,null,null,66657,69533,73748,null,null,79482,81680,84990,null,88811,null,92530,97343,99723]
[null,null,null,null,null,null,30162,33126,26830,null,14400,35177,37623,40593,43186,46074,51705,59530,null,null,66658,69534,73750,null,null,79483,81690,85000,null,88813,null,92533,97343,99725]
[null,null,null,null,null,null,30164,33127,26832,null,14406,35179,37624,40595,43187,46075,51713,59531,null,null,66660,69535,73751,null,null,79484,81700,85010,null,88815,null,92534,97343,99726]
[null,null,null,null,null,null,30165,33128,26834,null,14408,35180,37625,40596,43188,46076,51714,59532,null,null,66670,69536,73752,null,null,79485,81703,85013,null,88817,null,92535,97345,99730]
[null,null,null,null,null,null,30166,33130,26840,null,14409,35181,37630,40597,43189,46078,51715,59533,null,null,66672,69537,73753,null,null,79486,81705,85017,null,88818,null,92537,97345,99733]
[null,null,null,null,null,null,30167,33131,26843,null,14410,35182,37631,40598,43190,46080,51716,59534,null,null,66673,69540,73754,null,null,79487,81706,85019,null,88819,null,92539,97345,99734]
[null,null,null,null,null,null,30170,33132,26850,null,14420,35183,37632,40599,43191,46083,51720,59540,null,null,66674,69541,73756,null,null,79488,81707,85020,null,88820,null,92540,97345,99735]
[null,null,null,null,null,null,30172,33133,26860,null,14426,35185,37634,40600,43192,46084,51723,59543,null,null,66675,69545,73759,null,null,79489,81708,85023,null,88821,null,92543,97345,99736]
[null,null,null,null,null,null,30173,33135,26862,null,14427,35186,37635,40602,43196,46087,51724,59544,null,null,66679,69546,73760,null,null,79490,81709,85024,null,88823,null,92544,97345,99750]
[null,null,null,null,null,null,30174,33136,26870,null,14429,35187,37636,40603,43197,46100,51725,59545,null,null,66680,69547,73761,null,null,79491,81710,85030,null,88824,null,92549,97345,99753]
[null,null,null,null,null,null,30176,33137,26875,null,14430,35188,37640,40604,43200,46103,51726,59546,null,null,66683,69548,73763,null,null,79493,81712,85037,null,88825,null,92550,97345,99754]
[null,null,null,null,null,null,30178,33138,26879,null,14438,35189,37641,40605,43201,46104,51727,59547,null,null,66690,69550,73764,null,null,79500,81713,85038,null,88826,null,92560,97345,99755]
[null,null,null,null,null,null,30180,33139,26880,null,14439,35190,37642,40606,43202,46105,51730,59550,null,null,66693,69552,73765,null,null,79502,81715,85039,null,88827,null,92562,97345,99760]
[null,null,null,null,null,null,30182,33140,26885,null,14440,35191,37643,40607,43203,46106,51733,59552,null,null,66700,69553,73766,null,null,79503,81716,85040,null,88828,null,92564,97345,99763]
[null,null,null,null,null,null,30183,33142,26886,null,14449,35192,37644,40609,43204,46107,51734,59553,null,null,66708,69555,73770,null,null,79505,81717,85050,null,88830,null,92570,97345,99770]
[null,null,null,null,null,null,30184,33145,26890,null,14460,35193,37645,40610,43205,46109,51735,59554,null,null,66750,69556,73773,null,null,79506,81718,85053,null,88836,null,92571,97345,99773]
[null,null,null,null,null,null,30185,33146,26900,null,14470,35196,37646,40616,43206,46110,51750,59557,null,null,66757,69560,73774,null,null,79507,81719,85059,null,88837,null,92576,97346,99780]
[null,null,null,null,null,null,30187,33147,26903,null,15280,35197,37647,40620,43210,46112,51753,59560,null,null,66760,69561,73780,null,null,79508,81720,85060,null,88839,null,92580,97346,99783]
[null,null,null,null,null,null,30188,33148,26908,null,15290,35199,37650,40621,43211,46113,51754,59563,null,null,66765,69562,73783,null,null,79509,81724,85063,null,88840,null,92582,97346,99784]
[null,null,null,null,null,null,30189,33150,26910,null,15300,35200,37653,40630,43212,46114,51760,59566,null,null,66770,69563,73784,null,null,79510,81725,85064,null,88841,null,92590,97347,99785]
[null,null,null,null,null,null,30190,33151,26930,null,15309,35210,37654,40631,43218,46115,51765,59570,null,null,66773,69564,73785,null,null,79511,81727,85065,null,88849,null,92592,97347,99786]
[null,null,null,null,null,null,30193,33153,26940,null,15310,35213,37655,40632,43219,46117,51766,59573,null,null,66783,69565,73790,null,null,79512,81730,85070,null,88850,null,92597,97348,99790]
[null,null,null,null,null,null,30194,33154,26942,null,15320,35214,37660,40633,43220,46120,51767,59574,null,null,66785,69566,73791,null,null,79513,81733,85080,null,88854,null,92600,97350,99794]
[null,null,null,null,null,null,30195,33156,26943,null,15330,35219,37664,40634,43221,46123,51773,59575,null,null,66800,69567,73792,null,null,79520,81734,85090,null,88855,null,92604,97350,99800]
[null,null,null,null,null,null,30196,33157,26950,null,15339,35220,37665,40635,43222,46124,51775,59576,null,null,66810,69569,73794,null,null,79521,81735,85095,null,88856,null,92605,97353,99805]
[null,null,null,null,null,null,30197,33158,26954,null,15340,35222,37666,40636,43223,46126,51776,59577,null,null,66812,69570,73795,null,null,79523,81736,85096,null,88857,null,92607,97353,99806]
[null,null,null,null,null,null,30200,33159,26959,null,15350,35223,37667,40638,43224,46127,51777,59578,null,null,66820,69574,73796,null,null,79524,81737,85097,null,88859,null,92608,97353,99810]
[null,null,null,null,null,null,30202,33160,26960,null,15370,35224,37668,40639,43225,46130,51783,59580,null,null,66824,69577,73797,null,null,79525,81738,85098,null,88866,null,92610,97356,99814]
[null,null,null,null,null,null,30203,33163,26963,null,15380,35226,37669,40640,43230,46140,51784,59590,null,null,66825,69580,73798,null,null,79526,81740,85099,null,88875,null,92611,97357,99820]
[null,null,null,null,null,null,30204,33165,26964,null,15390,35227,37670,40642,43231,46145,51785,59593,null,null,66826,69581,73799,null,null,79530,81743,85100,null,88880,null,92613,97357,99823]
[null,null,null,null,null,null,30206,33166,26980,null,15400,35230,37673,40643,43232,46152,51786,59594,null,null,66827,69582,73800,null,null,79532,81745,85110,null,88882,null,92615,97357,99824]
[null,null,null,null,null,null,30207,33167,27000,null,15410,35233,37676,40644,43233,46153,51800,59595,null,null,66830,69584,73803,null,null,79533,81746,85120,null,88885,null,92616,97360,99825]
[null,null,null,null,null,null,30209,33170,27009,null,15420,35235,37677,40645,43234,46155,51810,59600,null,null,66835,69585,73811,null,null,79540,81749,85130,null,88886,null,92617,97362,99826]
[null,null,null,null,null,null,30210,33173,27010,null,15430,35236,37680,40646,43235,46157,51813,59610,null,null,66840,69590,73815,null,null,79543,81750,85134,null,88887,null,92618,97364,99827]
[null,null,null,null,null,null,30214,33179,27013,null,15440,35238,37683,40647,43236,46170,51814,59613,null,null,66842,69591,73816,null,null,79544,81753,85136,null,88890,null,92619,97365,99828]
[null,null,null,null,null,null,30215,33180,27014,null,15450,35239,37684,40648,43237,46174,51815,59614,null,null,66847,69595,73820,null,null,79545,81754,85137,null,88894,null,92620,97367,99830]
[null,null,null,null,null,null,30216,33183,27015,null,15460,35241,37685,40649,43238,46175,51816,59615,null,null,66848,69600,73830,null,null,79546,81755,85138,null,88895,null,92623,97367,99833]
[null,null,null,null,null,null,30217,33184,27016,null,15470,35244,37687,40650,43239,46176,51817,59616,null,null,66849,69603,73831,null,null,79547,81756,85140,null,88896,null,92624,97367,99834]
[null,null,null,null,null,null,30218,33185,27017,null,15500,35245,37688,40652,43240,46177,51820,59617,null,null,66850,69605,73840,null,null,79550,81757,85149,null,88897,null,92625,97370,99840]
[null,null,null,null,null,null,30220,33186,27018,null,15510,35246,37689,40653,43243,46180,51825,59618,null,null,66860,69606,73841,null,null,79553,81760,85150,null,88898,null,92627,97370,99843]
[null,null,null,null,null,null,30223,33187,27019,null,15520,35247,37690,40655,43244,46190,51826,59619,null,null,66861,69607,73850,null,null,79554,81763,85154,null,88900,null,92629,97370,99854]
[null,null,null,null,null,null,30224,33188,27020,null,15530,35248,37693,40657,43245,46194,51827,59620,null,null,66865,69608,73860,null,null,79555,81764,85157,null,88910,null,92630,97370,99855]
[null,null,null,null,null,null,30225,33190,27023,null,15540,35250,37696,40658,43247,46196,51850,59624,null,null,66872,69609,73863,null,null,79556,81765,85160,null,88920,null,92633,97370,99860]
[null,null,null,null,null,null,30227,33193,27029,null,15600,35253,37697,40659,43248,46197,51854,59625,null,null,66880,69610,73870,null,null,79557,81766,85167,null,88923,null,92635,97370,99862]
[null,null,null,null,null,null,30232,33194,27030,null,15610,35254,37698,40660,43250,46200,51855,59626,null,null,66900,69613,73880,null,null,79560,81770,85168,null,88925,null,92636,97370,99864]
[null,null,null,null,null,null,30233,33195,27039,null,15620,35255,37700,40661,43253,46202,51856,59627,null,null,66910,69614,73881,null,null,79562,81773,85169,null,88930,null,92637,97370,99865]
[null,null,null,null,null,null,30235,33196,27040,null,15630,35256,37710,40662,43254,46203,51857,59630,null,null,66930,69615,73885,null,null,79563,81774,85170,null,88933,null,92638,97370,99867]
[null,null,null,null,null,null,30236,33197,27050,null,15640,35257,37713,40663,43256,46204,51860,59633,null,null,66940,69616,73886,null,null,79564,81775,85180,null,88934,null,92639,97370,99870]
[null,null,null,null,null,null,30237,33198,27053,null,15650,35260,37715,40664,43257,46205,51863,59634,null,null,66945,69617,73887,null,null,79565,81776,85190,null,88935,null,92640,97370,99875]
[null,null,null,null,null,null,30240,33200,27054,null,15660,35263,37716,40665,43260,46206,51864,59635,null,null,66950,69620,73890,null,null,79566,81777,85193,null,88936,null,92643,97370,99900]
[null,null,null,null,null,null,30315,33201,27055,null,15670,35264,37717,40670,43263,46207,51865,59636,null,null,66955,69621,73895,null,null,79567,81780,85194,null,88940,null,92644,97370,99902]
[null,null,null,null,null,null,30330,33202,27056,null,15680,35265,37718,40671,43264,46208,51866,59637,null,null,66960,69625,73899,null,null,79569,81783,85195,null,88943,null,92646,97370,99904]
[null,null,null,null,null,null,30340,33203,27057,null,15700,35266,37720,40672,43265,46210,51867,59638,null,null,66964,69626,73900,null,null,79570,81784,85196,null,88944,null,92647,97370,99905]
[null,null,null,null,null,null,30350,33205,27058,null,15710,35267,37725,40673,43266,46225,51870,59640,null,null,66970,69627,73902,null,null,79573,81800,85197,null,88945,null,92648,97370,99906]
[null,null,null,null,null,null,30352,33206,27059,null,15730,35270,37727,40674,43269,46227,51874,59643,null,null,66973,69628,73903,null,null,79574,81802,85198,null,88946,null,92650,97370,99907]
[null,null,null,null,null,null,30353,33208,27060,null,15740,35274,37728,40675,43270,46228,51875,59646,null,null,66980,69630,73904,null,null,79575,81803,85199,null,88950,null,92652,97370,99908]
[null,null,null,null,null,null,30354,33209,27070,null,15750,35275,37729,40676,43273,46230,51880,59650,null,null,67000,69632,73905,null,null,79576,81804,85200,null,88959,null,92653,97370,99909]
[null,null,null,null,null,null,30356,33210,27073,null,15800,35280,37730,40677,43274,46234,51883,59653,null,null,67002,69633,73906,null,null,79577,81805,85203,null,88960,null,92654,97370,99910]
[null,null,null,null,null,null,30357,33213,27080,null,15810,35283,37732,40678,43275,46235,51900,59655,null,null,67003,69640,73907,null,null,79578,81806,85204,null,88970,null,92656,97370,99911]
[null,null,null,null,null,null,30358,33216,27083,null,15820,35284,37733,40680,43277,46236,51904,59656,null,null,67004,69641,73909,null,null,79580,81807,85205,null,88980,null,92658,97370,99912]
[null,null,null,null,null,null,30360,33217,27084,null,15830,35286,37734,40681,43279,46237,51905,59660,null,null,67010,69645,73910,null,null,79581,81810,85206,null,88990,null,92660,97370,99913]
[null,null,null,null,null,null,30362,33220,27085,null,15840,35293,37736,40682,43280,46238,51906,59663,null,null,67012,69651,73913,null,null,79584,81811,85207,null,88993,null,92663,97370,99914]
[null,null,null,null,null,null,30363,33224,27086,null,15850,35296,37737,40683,43281,46239,51907,59664,null,null,67030,69657,73914,null,null,79585,81812,85208,null,88994,null,92664,97370,99915]
[null,null,null,null,null,null,30364,33226,27087,null,3103,35297,37738,40684,43282,46240,51910,59665,null,null,67050,69659,73915,null,null,79586,81815,85209,null,88995,null,92665,97370,99916]
[null,null,null,null,null,null,30365,33227,27088,null,3104,35300,37740,40686,43283,46243,51915,59666,null,null,67052,69660,73916,null,null,79588,81820,85210,null,89000,null,92668,97370,99917]
[null,null,null,null,null,null,30367,33228,27089,null,3200,35310,37745,40687,43285,46245,51916,59667,null,null,67066,69665,73917,null,null,79589,81825,85212,null,89050,null,92670,97370,99918]
[null,null,null,null,null,null,30369,33230,27090,null,3230,35313,37746,40688,43287,46248,51917,59669,null,null,67087,69667,73918,null,null,79590,81827,85213,null,89060,null,92672,97370,99919]
[null,null,null,null,null,null,30370,33233,27096,null,3240,35314,37747,40689,43290,46249,51920,59670,null,null,67093,69670,73920,null,null,79592,81828,85214,null,89070,null,92676,97370,99920]
[null,null,null,null,null,null,30375,33234,27098,null,3300,35315,37748,40690,43291,46250,51923,59674,null,null,67097,69675,73923,null,null,79593,81830,85215,null,89080,null,92678,97370,99921]
[null,null,null,null,null,null,30378,33236,27100,null,3303,35316,37749,40691,43293,46255,51924,59675,null,null,67099,69676,73924,null,null,79594,81833,85216,null,89090,null,92680,97370,99930]
[null,null,null,null,null,null,30379,33237,27103,null,3310,35317,37750,40692,43294,46256,51930,59676,null,null,67100,69680,73925,null,null,79595,81834,85217,null,89100,null,92683,97370,99933]
[null,null,null,null,null,null,30380,33240,27104,null,3320,35320,37753,40693,43300,46259,51933,59680,null,null,67110,69681,73926,null,null,79596,81840,85218,null,89106,null,92684,97370,99934]
[null,null,null,null,null,null,30382,33244,27105,null,3330,35323,37754,40695,43301,46260,51936,59683,null,null,67112,69685,73927,null,null,79597,81843,85219,null,89107,null,92685,97370,99935]
[null,null,null,null,null,null,30383,33245,27106,null,3340,35324,37755,40696,43302,46270,51937,59684,null,null,67113,69690,73928,null,null,79599,81844,85220,null,89108,null,92686,97370,99937]
[null,null,null,null,null,null,30384,33247,27107,null,3400,35325,37756,40700,43304,46276,51950,59688,null,null,67115,69693,73930,null,null,79600,81845,85222,null,89109,null,92687,97370,99940]
[null,null,null,null,null,null,30385,33248,27108,null,3410,35326,37759,40701,43305,46280,51953,59689,null,null,67116,69694,73933,null,null,79603,81846,85223,null,89110,null,92690,97370,99943]
[null,null,null,null,null,null,30388,33250,27110,null,3420,35327,37760,40702,43306,46281,51954,59690,null,null,67117,69695,73934,null,null,79604,81847,85224,null,89118,null,92693,97370,99949]
[null,null,null,null,null,null,30389,33251,27119,null,3430,35330,37765,40703,43307,46282,51955,59694,null,null,67118,69696,73935,null,null,79605,81850,85225,null,89119,null,92694,97370,99950]
[null,null,null,null,null,null,30390,33252,27120,null,3440,35333,37766,40704,43308,46288,51956,59695,null,null,67119,69697,73937,null,null,79606,81854,85226,null,89120,null,92695,97370,99955]
[null,null,null,null,null,null,30393,33253,27130,null,3500,35334,37769,40705,43309,46290,51959,59696,null,null,67120,69698,73938,null,null,79607,81855,85227,null,89130,null,92697,97370,99957]
[null,null,null,null,null,null,30394,33255,27140,null,3510,35335,37770,40706,43310,46299,51960,59697,null,null,67123,69700,73939,null,null,79610,81856,85228,null,89136,null,92700,97370,99960]
[null,null,null,null,null,null,30395,33256,27148,null,3520,35336,37773,40708,43311,46300,51963,59698,null,null,67124,69702,73940,null,null,79613,81860,85229,null,89137,null,92701,97370,99964]
[null,null,null,null,null,null,30396,33257,27150,null,3530,35337,37774,40709,43313,46305,51964,59699,null,null,67125,69703,73941,null,null,79614,81864,85230,null,89138,null,92702,97370,99969]
[null,null,null,null,null,null,30397,33259,27159,null,3540,35340,37775,40710,43320,46310,51970,59700,null,null,67126,69704,73948,null,null,79615,81870,85232,null,89140,null,92703,97370,99970]
[null,null,null,null,null,null,30400,33260,27160,null,3550,35343,37776,40711,43321,46315,51973,59701,null,null,67128,69705,73949,null,null,79616,81871,85233,null,89150,null,92704,97370,99973]
[null,null,null,null,null,null,30406,33261,27167,null,3560,35344,37777,40712,43323,46325,51974,59703,null,null,67129,69706,73950,null,null,79617,81872,85234,null,89159,null,92705,97370,99974]
[null,null,null,null,null,null,30407,33262,27168,null,3570,35345,37790,40714,43324,46330,51977,59704,null,null,67130,69707,73953,null,null,79618,81873,85235,null,89160,null,92706,97370,99979]
[null,null,null,null,null,null,30409,33263,27170,null,3580,35346,37793,40715,43326,46350,51980,59710,null,null,67132,69708,73954,null,null,79619,81874,85236,null,89169,null,92707,97370,99980]
[null,null,null,null,null,null,30410,33264,27180,null,3590,35347,37795,40716,43327,46360,51984,59711,null,null,67133,69709,73956,null,null,79620,81875,85237,null,89170,null,92708,97370,99984]
[null,null,null,null,null,null,30412,33265,27190,null,3600,35350,37796,40717,43328,46370,51985,59712,null,null,67134,69710,73957,null,null,79623,81876,85238,null,89176,null,92710,97370,99987]
[null,null,null,null,null,null,30413,33266,27199,null,3610,35353,37797,40720,43329,46380,51986,59713,null,null,67140,69712,73958,null,null,79624,81877,85239,null,89177,null,92711,97370,99990]
[null,null,null,null,null,null,30415,33268,27200,null,3620,35354,37800,40723,43330,46385,51987,59714,null,null,67144,69713,73960,null,null,79625,81878,85240,null,89180,null,92713,97370,99993]
[null,null,null,null,null,null,30416,33269,27210,null,3630,35355,37803,40727,43333,46386,51988,59715,null,null,67150,69714,73965,null,null,79626,81880,85241,null,89190,null,92715,97370,99994]
[null,null,null,null,null,null,30417,33270,27217,null,3640,35356,37804,40729,43334,46400,51989,59716,null,null,67153,69715,73966,null,null,79630,81887,85243,null,89199,null,92716,97370,99997]
[null,null,null,null,null,null,30420,33273,27220,null,3650,35357,37805,40730,43335,46402,51990,59720,null,null,67154,69716,73967,null,null,79633,81888,85244,null,89210,null,92720,97370,99998]
[null,null,null,null,null,null,30422,33274,27228,null,3660,35360,37806,40731,43340,46403,51994,59721,null,null,67155,69717,73968,null,null,79634,81889,85245,null,89215,null,92722,97370]
[null,null,null,null,null,null,30423,33275,27229,null,3700,35363,37807,40732,43343,46404,51995,59722,null,null,67160,69718,73970,null,null,79635,81890,85246,null,89217,null,92723,97370]
[null,null,null,null,null,null,30424,33276,27230,null,3710,35364,37810,40733,43344,46405,51996,59723,null,null,67163,69719,73972,null,null,79636,81891,85247,null,89218,null,92724,97370]
[null,null,null,null,null,null,30425,33277,27240,null,3720,35366,37813,40734,43345,46407,51997,59724,null,null,67164,69720,73974,null,null,79637,81892,85248,null,89219,null,92726,97370]
[null,null,null,null,null,null,30426,33280,27250,null,3730,35367,37814,40735,43346,46408,52000,59725,null,null,67165,69724,73975,null,null,79640,81893,85249,null,89220,null,92727,97370]
[null,null,null,null,null,null,30427,33281,27258,null,3740,35368,37816,40736,43347,46409,52004,59730,null,null,67167,69725,73976,null,null,79643,81895,85250,null,89229,null,92728,97370]
[null,null,null,null,null,null,30428,33283,27260,null,3800,35370,37817,40737,43350,46420,52005,59732,null,null,67168,69726,73977,null,null,79644,81900,85251,null,89230,null,92730,97370]
[null,null,null,null,null,null,30429,33284,27265,null,3810,35371,37819,40740,43353,46430,52006,59734,null,null,67169,69729,73978,null,null,79645,81902,85252,null,89239,null,92733,97370]
[null,null,null,null,null,null,30430,33285,27266,null,3820,35373,37820,40741,43354,46433,52010,59735,null,null,67170,69730,73980,null,null,79646,81903,85253,null,89240,null,92734,97370]
[null,null,null,null,null,null,30431,33286,27267,null,3840,35374,37821,40744,43355,46440,52020,59736,null,null,67173,69731,73982,null,null,79647,81904,85254,null,89250,null,92735,97370]
[null,null,null,null,null,null,30433,33287,27268,null,3900,35375,37823,40745,43356,46445,52030,59737,null,null,67174,69735,73983,null,null,79650,81906,85255,null,89258,null,92736,97370]
[null,null,null,null,null,null,30434,33288,27269,null,3910,35380,37824,40746,43357,46446,52040,59740,null,null,67175,69737,73985,null,null,79653,81907,85256,null,89260,null,92737,97370]
[null,null,null,null,null,null,30437,33293,27270,null,3920,35381,37825,40747,43358,46448,52043,59744,null,null,67176,69740,73986,null,null,79654,81910,85257,null,89268,null,92740,97370]
[null,null,null,null,null,null,30438,33294,27272,null,3930,35383,37826,40748,43359,46450,52044,59745,null,null,67177,69742,73987,null,null,79655,81912,85258,null,89270,null,92742,97373]
[null,null,null,null,null,null,30439,33295,27273,null,3940,35385,37828,40750,43360,46454,52045,59750,null,null,67178,69743,73989,null,null,79656,81913,85259,null,89280,null,92744,97374]
[null,null,null,null,null,null,30440,33296,27274,null,4000,35390,37829,40751,43361,46455,52046,59753,null,null,67179,69744,73990,null,null,79657,81915,85260,null,89290,null,92746,97374]
[null,null,null,null,null,null,30441,33297,27275,null,4010,35393,37830,40754,43362,46457,52047,59758,null,null,67180,69750,73992,null,null,79660,81916,85265,null,89298,null,92747,97374]
[null,null,null,null,null,null,30442,33298,27276,null,4020,35395,37832,40758,43364,46460,52050,59759,null,null,67182,69751,73993,null,null,79663,81920,85270,null,89309,null,92750,97376]
[null,null,null,null,null,null,30443,33299,27277,null,4030,35400,37838,40760,43370,46463,52054,59760,null,null,67183,69753,73994,null,null,79664,81924,85273,null,89310,null,92752,97377]
[null,null,null,null,null,null,30445,33300,27278,null,16430,35410,37840,40761,43371,46466,52055,59762,null,null,67184,69760,73995,null,null,79665,81930,85275,null,89314,null,92753,97377]
[null,null,null,null,null,null,30446,33301,27279,null,16440,35413,37842,40762,43373,46470,52059,59763,null,null,67185,69770,73996,null,null,79670,81933,85276,null,89316,null,92754,97378]
[null,null,null,null,null,null,30447,33303,27280,null,16443,35414,37843,40764,43374,46472,52060,59764,null,null,67186,69773,73997,null,null,79673,81935,85277,null,89317,null,92755,97380]
[null,null,null,null,null,null,30448,33304,27287,null,16450,35415,37844,40765,43375,46473,52064,59765,null,null,67188,69774,73998,null,null,79674,81940,85278,null,89318,null,92756,97380]
[null,null,null,null,null,null,30449,33305,27289,null,16457,35416,37846,40766,43379,46474,52065,59766,null,null,67189,69775,73999,null,null,79675,81943,85280,null,89319,null,92760,97380]
[null,null,null,null,null,null,30450,33306,27290,null,16459,35417,37848,40767,43380,46475,52067,59770,null,null,67190,69776,74000,null,null,79676,81945,85283,null,89320,null,92762,97380]
[null,null,null,null,null,null,30453,33307,27293,null,16500,35420,37849,40768,43381,46480,52070,59773,null,null,67192,69777,74010,null,null,79677,81946,85284,null,89325,null,92763,97380]
[null,null,null,null,null,null,30454,33309,27294,null,16513,35423,37850,40769,43382,46488,52073,59774,null,null,67193,69780,74013,null,null,79680,81947,85285,null,89326,null,92764,97382]
[null,null,null,null,null,null,30455,33310,27295,null,16514,35424,37853,40770,43383,46489,52074,59775,null,null,67194,69782,74020,null,null,79683,81950,85286,null,89327,null,92769,97383]
[null,null,null,null,null,null,30456,33314,27296,null,16520,35425,37854,40771,43384,46490,52075,59776,null,null,67195,69783,74021,null,null,79684,81960,85287,null,89328,null,92770,97383]
[null,null,null,null,null,null,30457,33315,27297,null,16530,35426,37855,40772,43385,46495,52076,59780,null,null,67196,69784,74030,null,null,79685,81963,85288,null,89329,null,92773,97383]
[null,null,null,null,null,null,30458,33316,27298,null,16533,35427,37856,40773,43386,46500,52077,59783,null,null,67197,69785,74031,null,null,79686,81964,85290,null,89330,null,92774,97386]
[null,null,null,null,null,null,30461,33318,27299,null,16550,35430,37857,40775,43387,46502,52080,59786,null,null,67198,69786,74040,null,null,79687,81965,85293,null,89336,null,92775,97387]
[null,null,null,null,null,null,30462,33320,27300,null,16600,35433,37860,40780,43389,46503,52082,59787,null,null,67199,69787,74041,null,null,79690,81967,85294,null,89337,null,92776,97387]
[null,null,null,null,null,null,30463,33323,27309,null,16604,35434,37864,40781,43390,46506,52083,59790,null,null,67200,69788,74042,null,null,79693,81970,85295,null,89338,null,92780,97388]
[null,null,null,null,null,null,30464,33324,27310,null,16605,35435,37866,40782,43391,46507,52084,59791,null,null,67202,69790,74050,null,null,79694,81971,85296,null,89339,null,92783,97388]
[null,null,null,null,null,null,30465,33325,27320,null,16606,35436,37867,40783,43392,46520,52085,59792,null,null,67203,69792,74053,null,null,79695,81972,85297,null,89340,null,92784,97389]
[null,null,null,null,null,null,30470,33326,27329,null,16607,35437,37870,40784,43398,46525,52088,59793,null,null,67204,69793,74058,null,null,79696,81973,85298,null,89344,null,92785,97390]
[null,null,null,null,null,null,30471,33327,27330,null,16609,35440,37873,40785,43400,46530,52089,59794,null,null,67205,69794,74059,null,null,79697,81975,85300,null,89345,null,92786,97390]
[null,null,null,null,null,null,30472,33330,27338,null,16610,35443,37874,40786,43401,46532,52090,59795,null,null,67250,69795,74060,null,null,79702,81976,85310,null,89346,null,92789,97390]
[null,null,null,null,null,null,30473,33333,27340,null,16614,35444,37875,40788,43403,46535,52094,59796,null,null,67253,69799,74064,null,null,79703,81977,85319,null,89347,null,92800,97390]
[null,null,null,null,null,null,30474,33334,27349,null,16615,35445,37876,40789,43404,46540,52095,59797,null,null,67254,69800,74068,null,null,79704,81980,85320,null,89348,null,92810,97390]
[null,null,null,null,null,null,30475,33335,27350,null,16616,35446,37877,40790,43406,46545,52096,59799,null,null,67255,69802,74069,null,null,79705,81983,85330,null,89349,null,92820,97390]
[null,null,null,null,null,null,30476,33336,27357,null,16617,35447,37880,40791,43407,46560,52100,59800,null,null,67256,69803,74070,null,null,79706,81985,85338,null,89350,null,92830,97390]
[null,null,null,null,null,null,30478,33337,27360,null,16620,35450,37883,40792,43408,46565,52104,59810,null,null,67257,69804,74074,null,null,79707,81986,85339,null,89355,null,92834,97390]
[null,null,null,null,null,null,30479,33340,27364,null,16629,35453,37884,40793,43409,46566,52105,59813,null,null,67258,69805,74078,null,null,79708,81988,85340,null,89356,null,92840,97390]
[null,null,null,null,null,null,30480,33346,27368,null,16630,35454,37885,40795,43410,46570,52106,59816,null,null,67259,69806,74079,null,null,79709,81989,85347,null,89357,null,92845,97390]
[null,null,null,null,null,null,30483,33347,27370,null,16640,35455,37886,40796,43411,46572,52107,59817,null,null,67260,69807,74080,null,null,79710,81990,85349,null,89358,null,92850,97390]
[null,null,null,null,null,null,30484,33350,27376,null,16710,35460,37887,40797,43412,46573,52110,59820,null,null,67262,69808,74088,null,null,79712,81991,85350,null,89359,null,92853,97390]
[null,null,null,null,null,null,30485,33360,27377,null,16720,35463,37888,40798,43420,46574,52120,59823,null,null,67265,69809,74089,null,null,79713,81993,85360,null,89360,null,92854,97390]
[null,null,null,null,null,null,30486,33363,27380,null,16739,35464,37890,40799,43421,46580,52140,59824,null,null,67266,69810,74090,null,null,79714,81995,85370,null,89364,null,92860,97390]
[null,null,null,null,null,null,30487,33364,27390,null,16740,35465,37892,40800,43422,46600,52143,59828,null,null,67267,69811,74100,null,null,79716,81996,85385,null,89365,null,92863,97390]
[null,null,null,null,null,null,30488,33365,27397,null,16749,35466,37893,40802,43423,46614,52144,59830,null,null,67269,69812,74102,null,null,79717,81997,85386,null,89366,null,92870,97390]
[null,null,null,null,null,null,30491,33366,27399,null,16750,35467,37894,40803,43424,46615,52145,59833,null,null,67275,69815,74103,null,null,79720,82000,85388,null,89367,null,92875,97390]
[null,null,null,null,null,null,30492,33367,27400,null,16770,35470,37895,40804,43425,46616,52146,59834,null,null,67276,69816,74104,null,null,79721,82010,85389,null,89368,null,92876,97390]
[null,null,null,null,null,null,30493,33370,27403,null,16776,35473,37896,40806,43426,46620,52147,59835,null,null,67277,69817,74105,null,null,79722,82013,85390,null,89369,null,92880,97390]
[null,null,null,null,null,null,30494,33380,27405,null,16780,35474,37897,40807,43427,46626,52148,59836,null,null,67279,69818,74106,null,null,79725,82014,85397,null,89400,null,92883,97390]
[null,null,null,null,null,null,30495,33383,27406,null,16797,35475,37898,40810,43430,46627,52149,59840,null,null,67280,69820,74107,null,null,79727,82015,85398,null,89410,null,92888,97390]
[null,null,null,null,null,null,30496,33384,27407,null,16799,35477,37900,40811,43431,46630,52150,59843,null,null,67286,69824,74108,null,null,79728,82016,85399,null,89415,null,92890,97390]
[null,null,null,null,null,null,30498,33385,27410,null,16800,35480,37903,40812,43433,46640,52154,59844,null,null,67287,69825,74109,null,null,79729,82017,85400,null,89416,null,92893,97390]
[null,null,null,null,null,null,30499,33387,27412,null,16810,35483,37904,40814,43434,46649,52155,59845,null,null,67288,69826,74110,null,null,79730,82018,85405,null,89417,null,92894,97392]
[null,null,null,null,null,null,30500,33390,27413,null,16813,35484,37905,40815,43435,46680,52156,59850,null,null,67289,69827,74115,null,null,79731,82019,85406,null,89420,null,92895,97392]
[null,null,null,null,null,null,30503,33393,27414,null,16840,35485,37906,40816,43436,46686,52157,59853,null,null,67290,69828,74116,null,null,79732,82020,85409,null,89430,null,92900,97392]
[null,null,null,null,null,null,30504,33397,27415,null,16850,35490,37907,40820,43440,46687,52158,59854,null,null,67293,69830,74117,null,null,79733,82028,85410,null,89440,null,92903,97393]
[null,null,null,null,null,null,30505,33398,27416,null,16860,35493,37913,40824,43442,46688,52159,59855,null,null,67294,69834,74120,null,null,79734,82030,85415,null,89450,null,92904,97393]
[null,null,null,null,null,null,30506,33400,27420,null,16880,35496,37914,40825,43443,46689,52160,59856,null,null,67296,69836,74122,null,null,79735,82035,85420,null,89460,null,92905,97394]
[null,null,null,null,null,null,30507,33403,27422,null,16900,35497,37915,40826,43444,46700,52161,59857,null,null,67298,69837,74125,null,null,79740,82037,85423,null,89464,null,92906,97394]
[null,null,null,null,null,null,30509,33405,27423,null,2480,35500,37916,40827,43445,46706,52164,59860,null,null,67300,69838,74126,null,null,79745,82038,85424,null,89470,null,92907,97394]
[null,null,null,null,null,null,30510,33406,27425,null,2490,35510,37917,40828,43446,46707,52165,59863,null,null,67302,69840,74128,null,null,79746,82040,85425,null,89480,null,92909,97394]
[null,null,null,null,null,null,30511,33407,27426,null,2500,35513,37918,40829,43447,46708,52166,59864,null,null,67303,69841,74129,null,null,79747,82043,85426,null,89490,null,92910,97394]
[null,null,null,null,null,null,30513,33408,27430,null,2519,35514,37919,40830,43448,46709,52167,59865,null,null,67304,69845,74130,null,null,79748,82047,85427,null,89496,null,92911,97394]
[null,null,null,null,null,null,30514,33410,27433,null,2520,35515,37920,40831,43449,46710,52168,59870,null,null,67307,69846,74133,null,null,79750,82050,85428,null,89497,null,92912,97394]
[null,null,null,null,null,null,30515,33413,27434,null,2530,35516,37923,40832,43450,46715,52169,59873,null,null,67308,69848,74134,null,null,79751,82059,85430,null,89500,null,92913,97395]
[null,null,null,null,null,null,30519,33415,27435,null,2600,35520,37924,40833,43451,46716,52170,59874,null,null,67310,69850,74135,null,null,79753,82060,85440,null,89505,null,92914,97396]
[null,null,null,null,null,null,30520,33416,27436,null,2630,35523,37925,40834,43452,46717,52172,59875,null,null,67312,69855,74136,null,null,79754,82070,85444,null,89506,null,92915,97396]
[null,null,null,null,null,null,30523,33418,27438,null,2640,35524,37926,40835,43453,46718,52175,59880,null,null,67313,69859,74137,null,null,79755,82080,85447,null,89510,null,92916,97397]
[null,null,null,null,null,null,30524,33419,27440,null,2650,35525,37927,40836,43454,46719,52176,59884,null,null,67314,69860,74138,null,null,79760,82089,85448,null,89512,null,92917,97397]
[null,null,null,null,null,null,30525,33420,27442,null,2660,35526,37928,40837,43455,46720,52177,59885,null,null,67315,69862,74140,null,null,79766,82090,85450,null,89513,null,92920,97397]
[null,null,null,null,null,null,30526,33421,27443,null,2670,35527,37930,40840,43456,46723,52178,59890,null,null,67316,69863,74144,null,null,79767,82099,85454,null,89514,null,92922,97397]
[null,null,null,null,null,null,30527,33422,27444,null,2680,35530,37932,40841,43459,46724,52179,59893,null,null,67317,69864,74150,null,null,79770,82100,85455,null,89515,null,92923,97400]
[null,null,null,null,null,null,30528,33423,27445,null,2700,35533,37933,40843,43460,46725,52180,59894,null,null,67318,69865,74155,null,null,79773,82102,85456,null,89517,null,92925,97404]
[null,null,null,null,null,null,30529,33424,27446,null,2710,35534,37934,40845,43463,46726,52182,59900,null,null,67320,69866,74160,null,null,79774,82103,85457,null,89518,null,92926,97404]
[null,null,null,null,null,null,30530,33425,27447,null,2719,35535,37935,40847,43464,46728,52183,59904,null,null,67322,69867,74162,null,null,79775,82110,85460,null,89519,null,92927,97405]
[null,null,null,null,null,null,30533,33426,27448,null,2720,35536,37936,40849,43468,46729,52185,59905,null,null,67323,69868,74165,null,null,79776,82112,85463,null,89520,null,92928,97405]
[null,null,null,null,null,null,30534,33430,27449,null,2730,35540,37937,40850,43469,46730,52189,59906,null,null,67324,69870,74166,null,null,79777,82113,85465,null,89530,null,92929,97406]
[null,null,null,null,null,null,30535,33431,27450,null,2750,35543,37938,40852,43470,46732,52200,59908,null,null,67325,69873,74167,null,null,79780,82118,85467,null,89540,null,92930,97406]
[null,null,null,null,null,null,30536,33432,27452,null,2760,35545,37939,40853,43472,46733,52203,59920,null,null,67327,69874,74168,null,null,79781,82120,85470,null,89550,null,92933,97407]
[null,null,null,null,null,null,30537,33433,27453,null,2770,35546,37940,40854,43473,46734,52204,59921,null,null,67328,69875,74169,null,null,79782,82123,85476,null,89553,null,92934,97410]
[null,null,null,null,null,null,30540,33435,27454,null,2780,35547,37943,40855,43474,46735,52205,59922,null,null,67329,69880,74170,null,null,79783,82124,85477,null,89554,null,92935,97414]
[null,null,null,null,null,null,30543,33440,27455,null,2790,35550,37944,40857,43480,46736,52210,59923,null,null,67330,69885,74173,null,null,79784,82125,85480,null,89555,null,92936,97415]
[null,null,null,null,null,null,30545,33443,27456,null,2800,35553,37945,40859,43483,46737,52213,59925,null,null,67334,69890,74180,null,null,79785,82126,85484,null,89556,null,92937,97415]
[null,null,null,null,null,null,30546,33444,27457,null,2810,35554,37946,40860,43484,46738,52214,59926,null,null,67337,69891,74183,null,null,79786,82127,85486,null,89560,null,92940,97417]
[null,null,null,null,null,null,30547,33450,27458,null,2830,35555,37947,40863,43485,46740,52215,59927,null,null,67338,69895,74190,null,null,79788,82128,85488,null,89566,null,92941,97420]
[null,null,null,null,null,null,30548,33451,27459,null,2840,35556,37948,40864,43486,46745,52220,59928,null,null,67340,69900,74200,null,null,79790,82129,85489,null,89567,null,92942,97420]
[null,null,null,null,null,null,30549,33452,27460,null,2860,35560,37950,40865,43487,46746,52223,59930,null,null,67344,69901,74210,null,null,79793,82130,85490,null,89570,null,92943,97424]
[null,null,null,null,null,null,30550,33454,27463,null,2870,35563,37953,40866,43488,46749,52224,59931,null,null,67350,69902,74215,null,null,79794,82132,85499,null,89580,null,92970,97425]
[null,null,null,null,null,null,30553,33455,27464,null,2900,35565,37954,40867,43490,46750,52225,59934,null,null,67353,69903,74218,null,null,79795,82133,85500,null,89590,null,92972,97426]
[null,null,null,null,null,null,30554,33456,27465,null,2910,35567,37955,40870,43491,46757,52226,59935,null,null,67354,69907,74220,null,null,79796,82134,85503,null,89600,null,92973,97430]
[null,null,null,null,null,null,30555,33460,27466,null,2920,35573,37956,40873,43493,46758,52227,59937,null,null,67362,69908,74227,null,null,79797,82136,85505,null,89602,null,92974,97430]
[null,null,null,null,null,null,30556,33464,27467,null,2930,35574,37957,40874,43494,46760,52230,59940,null,null,67363,69909,74230,null,null,79798,82137,85506,null,89603,null,92975,97432]
[null,null,null,null,null,null,30558,33465,27468,null,2940,35575,37958,40875,43495,46762,52233,59943,null,null,67370,69910,74239,null,null,79800,82138,85507,null,89604,null,92976,97432]
[null,null,null,null,null,null,30559,33466,27470,null,2950,35576,37960,40880,43496,46763,52234,59944,null,null,67373,69912,74240,null,null,79802,82139,85508,null,89605,null,92977,97432]
[null,null,null,null,null,null,30560,33467,27473,null,2960,35577,37965,40881,43500,46764,52235,59945,null,null,67374,69915,74250,null,null,79803,82140,85509,null,89606,null,92978,97432]
[null,null,null,null,null,null,30563,33470,27474,null,2970,35580,37966,40882,43502,46765,52236,59946,null,null,67380,69920,74260,null,null,79804,82143,85510,null,89607,null,92980,97432]
[null,null,null,null,null,null,30564,33473,27475,null,2980,35584,37967,40883,43503,46770,52240,59947,null,null,67383,69925,74270,null,null,79805,82144,85513,null,89610,null,92983,97432]
[null,null,null,null,null,null,30565,33474,27476,null,2990,35585,37970,40884,43505,46775,52243,59948,null,null,67400,69930,74280,null,null,79806,82146,85514,null,89613,null,92984,97432]
[null,null,null,null,null,null,30566,33475,27477,null,3000,35586,37973,40885,43508,46776,52244,59950,null,null,67403,69935,74290,null,null,79807,82147,85515,null,89614,null,92985,97432]
[null,null,null,null,null,null,30567,33476,27478,null,3010,35590,37974,40886,43510,46777,52250,59953,null,null,67405,69936,74293,null,null,79810,82148,85516,null,89615,null,92987,97432]
[null,null,null,null,null,null,30568,33477,27479,null,3020,35593,37975,40888,43514,46780,52254,59954,null,null,67406,69937,74294,null,null,79811,82149,85518,null,89620,null,92990,97433]
[null,null,null,null,null,null,30570,33480,27480,null,3023,35594,37976,40889,43515,46783,52280,59955,null,null,67413,69940,74295,null,null,79812,82150,85519,null,89625,null,92994,97433]
[null,null,null,null,null,null,30573,33483,27484,null,3100,35600,37977,40890,43516,46785,52282,59956,null,null,67414,69943,74300,null,null,79813,82153,85520,null,89630,null,93000,97433]
[null,null,null,null,null,null,30574,33484,27485,null,13070,35610,37978,40892,43517,46790,52286,59957,null,null,67415,69944,74305,null,null,79814,82154,85523,null,89632,null,93003,97433]
[null,null,null,null,null,null,30575,33485,27486,null,13080,35614,37980,40893,43523,46792,52290,59958,null,null,67416,69945,74310,null,null,79815,82155,85524,null,89633,null,93004,97434]
[null,null,null,null,null,null,30576,33486,27487,null,13090,35615,37983,40894,43525,46794,52300,59960,null,null,67417,69946,74320,null,null,79816,82156,85525,null,89635,null,93005,97434]
[null,null,null,null,null,null,30577,33487,27488,null,13093,35616,37984,40895,43527,46797,52303,59963,null,null,67423,69950,74325,null,null,79817,82157,85526,null,89636,null,93010,97434]
[null,null,null,null,null,null,30580,33488,27489,null,13094,35617,37985,40896,43530,46798,52304,59964,null,null,67430,69953,74330,null,null,79818,82158,85527,null,89640,null,93015,97434]
[null,null,null,null,null,null,30582,33490,27490,null,13099,35620,37986,40897,43538,46799,52305,59965,null,null,67440,69954,74334,null,null,79819,82159,85530,null,89641,null,93020,97434]
[null,null,null,null,null,null,30583,33493,27494,null,13100,35623,37987,40900,43540,46800,52307,59966,null,null,67448,69955,74335,null,null,79820,82160,85533,null,89642,null,93030,97436]
[null,null,null,null,null,null,30584,33494,27498,null,13120,35624,37988,40902,43542,46810,52310,59967,null,null,67450,69957,74336,null,null,79821,82163,85534,null,89643,null,93040,97436]
[null,null,null,null,null,null,30585,33495,27499,null,13150,35625,37990,40903,43543,46815,52315,59970,null,null,67451,69960,74337,null,null,79822,82164,85535,null,89644,null,93041,97437]
[null,null,null,null,null,null,30586,33496,27500,null,13180,35626,37991,40904,43544,46820,52316,59972,null,null,67453,69962,74339,null,null,79823,82165,85536,null,89645,null,93050,97440]
[null,null,null,null,null,null,30587,33497,27502,null,13200,35627,37993,40905,43545,46826,52317,59973,null,null,67454,69963,74340,null,null,79825,82170,85537,null,89650,null,93060,97440]
[null,null,null,null,null,null,30590,33498,27505,null,13210,35630,37994,40906,43546,46827,52320,59974,null,null,67455,69964,74342,null,null,79826,82180,85540,null,89670,null,93062,97440]
[null,null,null,null,null,null,30593,33500,27507,null,13219,35633,37995,40908,43547,46829,52330,59975,null,null,67456,69965,74343,null,null,79830,82183,85545,null,89672,null,93063,97440]
[null,null,null,null,null,null,30594,33504,27508,null,13220,35634,37996,40909,43550,46830,52333,59980,null,null,67457,69966,74350,null,null,79833,82185,85549,null,89673,null,93068,97440]
[null,null,null,null,null,null,30595,33505,27510,null,13230,35635,37997,40912,43553,46840,52334,59983,null,null,67458,69970,74355,null,null,79834,82186,85550,null,89674,null,93070,97443]
[null,null,null,null,null,null,30596,33506,27511,null,13250,35636,37998,40913,43554,46845,52336,59986,null,null,67459,69980,74357,null,null,79835,82187,85553,null,89675,null,93071,97443]
[null,null,null,null,null,null,30597,33515,27514,null,13270,35637,38000,40914,43558,46846,52337,59987,null,null,67460,69982,74358,null,null,79836,82188,85556,null,89676,null,93072,97444]
[null,null,null,null,null,null,30600,33516,27515,null,13273,35640,38010,40915,43559,46850,52340,59990,null,null,67462,69983,74360,null,null,79837,82190,85560,null,89677,null,93073,97444]
[null,null,null,null,null,null,30603,33517,27516,null,13278,35643,38013,40919,43560,46855,52343,59991,null,null,67463,69990,74363,null,null,79840,82195,85563,null,89678,null,93074,97444]
[null,null,null,null,null,null,30604,33530,27517,null,13280,35644,38014,40920,43563,46860,52345,59993,null,null,67464,69991,74365,null,null,79841,82196,85564,null,89679,null,93076,97444]
[null,null,null,null,null,null,30605,33531,27518,null,13300,35645,38015,40922,43564,46900,52346,59995,null,null,67465,69995,74367,null,null,79842,82197,85565,null,89693,null,93080,97444]
[null,null,null,null,null,null,30606,33535,27520,null,13310,35646,38016,40928,43565,46903,52347,60000,null,null,67467,70000,74368,null,null,79843,82198,85580,null,89700,null,93083,97444]
[null,null,null,null,null,null,30607,33536,27521,null,13315,35647,38017,40929,43567,46905,52350,60010,null,null,67469,70010,74369,null,null,79846,82199,85600,null,89703,null,93084,97444]
[null,null,null,null,null,null,30610,33537,27522,null,13319,35650,38018,40930,43568,46907,52353,60013,null,null,67470,70013,74370,null,null,79849,82200,85606,null,89704,null,93085,97445]
[null,null,null,null,null,null,30613,33538,27523,null,13360,35654,38019,40932,43569,46920,52354,60014,null,null,67473,70014,74373,null,null,79850,82203,85608,null,89705,null,93086,97446]
[null,null,null,null,null,null,30614,33539,27524,null,13400,35656,38020,40933,43570,46930,52355,60016,null,null,67474,70015,74374,null,null,79851,82204,85609,null,89706,null,93100,97446]
[null,null,null,null,null,null,30615,33540,27525,null,13410,35657,38024,40934,43571,46934,52356,60017,null,null,67475,70020,74375,null,null,79852,82205,85610,null,89707,null,93104,97450]
[null,null,null,null,null,null,30616,33544,27526,null,13419,35660,38027,40935,43573,46935,52357,60020,null,null,67480,70023,74376,null,null,79853,82206,85613,null,89710,null,93105,97452]
[null,null,null,null,null,null,30617,33545,27527,null,13420,35663,38028,40936,43574,46937,52360,60024,null,null,67483,70024,74377,null,null,79854,82207,85614,null,89712,null,93110,97452]
[null,null,null,null,null,null,30620,33550,27528,null,13430,35664,38030,40937,43575,46940,52362,60030,null,null,67484,70030,74378,null,null,79856,82210,85615,null,89713,null,93120,97453]
[null,null,null,null,null,null,30623,33551,27529,null,13440,35665,38033,40938,43576,46943,52363,60033,null,null,67485,70033,74379,null,null,79859,82213,85618,null,89715,null,93122,97453]
[null,null,null,null,null,null,30624,33553,27530,null,13450,35666,38034,40939,43580,46945,52364,60040,null,null,67486,70034,74380,null,null,79860,82214,85619,null,89716,null,93124,97454]
[null,null,null,null,null,null,30625,33555,27531,null,13460,35667,38035,40940,43583,46950,52365,60044,null,null,67488,70040,74382,null,null,79861,82215,85620,null,89720,null,93140,97455]
[null,null,null,null,null,null,30626,33560,27532,null,13508,35670,38036,40941,43584,46954,52366,60050,null,null,67490,70043,74385,null,null,79863,82216,85640,null,89723,null,93147,97456]
[null,null,null,null,null,null,30627,33563,27533,null,13509,35673,38037,40942,43585,46955,52367,60054,null,null,67492,70044,74389,null,null,79864,82217,85641,null,89724,null,93150,97457]
[null,null,null,null,null,null,30630,33564,27534,null,13510,35674,38040,40943,43586,46960,52370,60060,null,null,67493,70045,74390,null,null,79865,82230,85643,null,89725,null,93152,97458]
[null,null,null,null,null,null,30633,33565,27535,null,13520,35675,38046,40944,43587,46963,52374,60063,null,null,67496,70046,74393,null,null,79866,82233,85650,null,89726,null,93153,97458]
[null,null,null,null,null,null,30634,33566,27536,null,13530,35676,38047,40947,43590,46966,52376,60070,null,null,67497,70050,74394,null,null,79867,82234,85656,null,89727,null,93154,97460]
[null,null,null,null,null,null,30635,33567,27537,null,13540,35677,38048,40950,43592,46967,52380,60073,null,null,67498,70053,74395,null,null,79870,82235,85660,null,89729,null,93157,97460]
[null,null,null,null,null,null,30636,33570,27540,null,13545,35680,38050,40951,43593,46970,52387,60074,null,null,67499,70054,74397,null,null,79871,82236,85670,null,89730,null,93158,97466]
[null,null,null,null,null,null,30637,33573,27543,null,13549,35683,38057,40952,43594,46974,52390,60080,null,null,67500,70055,74400,null,null,79874,82238,85673,null,89731,null,93160,97470]
[null,null,null,null,null,null,30640,33574,27544,null,13550,35684,38060,40953,43595,46975,52400,60090,null,null,67510,70100,74410,null,null,79876,82240,85674,null,89732,null,93162,97473]
[null,null,null,null,null,null,30643,33575,27545,null,4040,35685,38063,40954,43596,46980,52403,60094,null,null,67512,70102,74418,null,null,79878,82243,85675,null,89734,null,93163,97473]
[null,null,null,null,null,null,30644,33576,27546,null,4100,35686,38065,40955,43600,46984,52410,60095,null,null,67515,70103,74419,null,null,79879,82245,85676,null,89735,null,93164,97474]
[null,null,null,null,null,null,30645,33577,27547,null,4120,35687,38067,40956,43604,46990,52413,60100,null,null,67520,70104,74420,null,null,79880,82246,85680,null,89736,null,93165,97474]
[null,null,null,null,null,null,30646,33580,27548,null,4200,35690,38068,40957,43610,46995,52414,60105,null,null,67528,70109,74430,null,null,79884,82247,85681,null,89740,null,93166,97474]
[null,null,null,null,null,null,30647,33583,27550,null,4210,35693,38070,40958,43612,46996,52415,60110,null,null,67530,70110,74435,null,null,79885,82248,85690,null,89744,null,93167,97475]
[null,null,null,null,null,null,30648,33584,27560,null,4230,35694,38078,40960,43615,46997,52416,60120,null,null,67535,70113,74440,null,null,79887,82249,85695,null,89746,null,93169,97476]
[null,null,null,null,null,null,30649,33585,27565,null,4240,35695,38079,40961,43623,47000,52420,60123,null,null,67540,70115,74443,null,null,79888,82264,85700,null,89750,null,93170,97477]
[null,null,null,null,null,null,30650,33586,27570,null,4250,35696,38080,40962,43624,47010,52423,60124,null,null,67541,70117,74448,null,null,79889,82266,85710,null,89751,null,93172,97480]
[null,null,null,null,null,null,30654,33587,27575,null,4260,35697,38083,40963,43625,47011,52424,60125,null,null,67543,70120,74450,null,null,79890,82267,85713,null,89752,null,93173,97483]
[null,null,null,null,null,null,30655,33590,27579,null,4300,35698,38085,40964,43626,47013,52425,60126,null,null,67544,70121,74460,null,null,79891,82269,85714,null,89753,null,93174,97486]
[null,null,null,null,null,null,30656,33593,27580,null,4310,35700,38086,40966,43627,47014,52426,60127,null,null,67550,70124,74463,null,null,79893,82270,85715,null,89755,null,93175,97490]
[null,null,null,null,null,null,30660,33594,27586,null,4318,35703,38088,40967,43628,47015,52427,60128,null,null,67554,70125,74467,null,null,79895,82273,85716,null,89756,null,93176,97500]
[null,null,null,null,null,null,30662,33595,27587,null,4320,35704,38090,40968,43629,47020,52430,60130,null,null,67560,70130,74470,null,null,79900,82274,85717,null,89757,null,93180,97500]
[null,null,null,null,null,null,30664,33596,27588,null,4330,35705,38094,40970,43630,47023,52433,60133,null,null,67563,70133,74480,null,null,79901,82275,85720,null,89758,null,93181,97500]
[null,null,null,null,null,null,30665,33597,27600,null,4340,35706,38095,40972,43632,47030,52434,60134,null,null,67570,70135,74490,null,null,79903,82277,85730,null,89759,null,93182,97500]
[null,null,null,null,null,null,30666,33600,27601,null,4360,35707,38096,40973,43633,47040,52435,60135,null,null,67580,70137,74500,null,null,79904,82300,85733,null,89760,null,93183,97500]
[null,null,null,null,null,null,30667,33601,27602,null,4369,35710,38097,40974,43640,47050,52436,60136,null,null,67587,70138,74505,null,null,79905,82303,85734,null,89762,null,93184,97504]
[null,null,null,null,null,null,30670,33604,27603,null,4370,35713,38098,40976,43642,47059,52437,60137,null,null,67588,70140,74506,null,null,79906,82304,85735,null,89763,null,93185,97504]
[null,null,null,null,null,null,30673,33605,27604,null,4380,35714,38099,40977,43645,47060,52440,60140,null,null,67589,70141,74507,null,null,79907,82305,85736,null,89764,null,93190,97506]
[null,null,null,null,null,null,30674,33610,27605,null,4390,35720,38100,40978,43646,47069,52443,60143,null,null,67590,70142,74508,null,null,79908,82306,85737,null,89767,null,93193,97510]
[null,null,null,null,null,null,30675,33618,27606,null,4400,35723,38104,40980,43648,47070,52444,60150,null,null,67599,70143,74510,null,null,79910,82310,85740,null,89768,null,93194,97513]
[null,null,null,null,null,null,30676,33620,27607,null,4410,35724,38105,40981,43649,47073,52460,60153,null,null,67600,70144,74514,null,null,79913,82313,85760,null,89774,null,93195,97515]
[null,null,null,null,null,null,30677,33623,27609,null,4420,35726,38106,40982,43650,47078,52463,60154,null,null,67604,70145,74516,null,null,79915,82314,85764,null,89778,null,93196,97515]
[null,null,null,null,null,null,30680,33624,27610,null,4440,35727,38110,40983,43659,47079,52464,60155,null,null,67606,70146,74520,null,null,79916,82320,85765,null,89780,null,93197,97516]
[null,null,null,null,null,null,30683,33625,27611,null,4450,35730,38113,40984,43660,47080,52465,60156,null,null,67607,70148,74521,null,null,79917,82329,85766,null,89783,null,93198,97520]
[null,null,null,null,null,null,30686,33626,27612,null,4460,35733,38114,40985,43669,47089,52466,60157,null,null,67608,70150,74522,null,null,79920,82330,85767,null,89784,null,93199,97522]
[null,null,null,null,null,null,30689,33627,27613,null,4470,35737,38115,40986,43670,47090,52467,60160,null,null,67610,70155,74530,null,null,79922,82334,85770,null,89785,null,93210,97522]
[null,null,null,null,null,null,30690,33630,27614,null,4480,35740,38116,40987,43673,47093,52470,60170,null,null,67611,70156,74534,null,null,79923,82335,85773,null,89789,null,93213,97523]
[null,null,null,null,null,null,30693,33633,27616,null,4489,35744,38117,40988,43679,47095,52473,60173,null,null,67612,70157,74540,null,null,79924,82350,85774,null,89790,null,93220,97524]
[null,null,null,null,null,null,30695,33634,27618,null,4490,35745,38119,40989,43680,47100,52476,60174,null,null,67613,70158,74544,null,null,79925,82353,85775,null,89791,null,93228,97527]
[null,null,null,null,null,null,30700,33635,27621,null,4500,35746,38120,40990,43684,47103,52477,60175,null,null,67614,70160,74545,null,null,79926,82354,85776,null,89792,null,93230,97527]
[null,null,null,null,null,null,30705,33636,27622,null,4510,35750,38123,40992,43685,47105,52480,60180,null,null,67615,70161,74546,null,null,79927,82355,85777,null,89795,null,93236,97530]
[null,null,null,null,null,null,30709,33637,27623,null,4519,35753,38124,40994,43688,47106,52483,60183,null,null,67616,70163,74547,null,null,79928,82360,85780,null,89796,null,93240,97532]
[null,null,null,null,null,null,30710,33640,27624,null,4530,35754,38125,40997,43689,47107,52484,60190,null,null,67617,70164,74550,null,null,79929,82363,85785,null,89797,null,93248,97535]
[null,null,null,null,null,null,30716,33643,27625,null,4600,35756,38126,41000,43690,47109,52485,60193,null,null,67618,70165,74557,null,null,79930,82365,85786,null,89800,null,93249,97536]
[null,null,null,null,null,null,30718,33644,27626,null,4610,35760,38127,41002,43695,47110,52486,60194,null,null,67619,70166,74560,null,null,79933,82366,85788,null,89810,null,93250,97536]
[null,null,null,null,null,null,30719,33645,27627,null,4620,35763,38130,41003,43696,47116,52487,60200,null,null,67637,70168,74565,null,null,79934,82369,85789,null,89815,null,93260,97536]
[null,null,null,null,null,null,30720,33646,27640,null,4630,35764,38133,41004,43697,47117,52490,60201,null,null,67639,70170,74566,null,null,79935,82370,85790,null,89816,null,93269,97540]
[null,null,null,null,null,null,30723,33647,27642,null,1220,35765,38134,41005,43698,47118,52493,60202,null,null,67640,70175,74567,null,null,79936,82373,85793,null,89817,null,93270,97540]
[null,null,null,null,null,null,30724,33650,27643,null,1230,35766,38135,41006,43699,47119,52494,60203,null,null,67650,70177,74568,null,null,79937,82380,85794,null,89818,null,93276,97540]
[null,null,null,null,null,null,30725,33651,27644,null,1239,35767,38136,41007,43700,47120,52495,60205,null,null,67670,70178,74570,null,null,79938,82384,85795,null,89819,null,93279,97540]
[null,null,null,null,null,null,30726,33652,27645,null,1240,35770,38137,41010,43703,47123,52496,60206,null,null,67674,70180,74573,null,null,79940,82400,85796,null,89820,null,93280,97540]
[null,null,null,null,null,null,30729,33653,27646,null,1250,35773,38140,41013,43704,47124,52497,60207,null,null,67676,70185,74575,null,null,79941,82410,85797,null,89827,null,93290,97540]
[null,null,null,null,null,null,30730,33654,27650,null,1259,35774,38143,41014,43705,47125,52500,60210,null,null,67677,70189,74576,null,null,79942,82419,85798,null,89829,null,93294,97540]
[null,null,null,null,null,null,30734,33655,27652,null,1260,35775,38144,41015,43707,47126,52503,60211,null,null,67680,70190,74577,null,null,79943,82420,85800,null,89830,null,93295,97540]
[null,null,null,null,null,null,30735,33656,27654,null,1269,35776,38145,41016,43709,47127,52504,60213,null,null,67690,70195,74578,null,null,79944,82430,85810,null,89837,null,93300,97545]
[null,null,null,null,null,null,30736,33660,27655,null,1270,35780,38146,41017,43710,47128,52505,60215,null,null,67700,70200,74580,null,null,79945,82440,85820,null,89838,null,93305,97550]
[null,null,null,null,null,null,30737,33663,27656,null,1275,35783,38147,41020,43713,47129,52506,60216,null,null,67710,70201,74582,null,null,79946,82457,85823,null,89839,null,93306,97550]
[null,null,null,null,null,null,30738,33665,27657,null,1276,35784,38150,41023,43715,47130,52540,60220,null,null,67713,70206,74584,null,null,79947,82458,85825,null,89840,null,93308,97553]
[null,null,null,null,null,null,30739,33669,27660,null,1278,35785,38152,41024,43720,47133,52542,60222,null,null,67714,70207,74585,null,null,79948,82459,85826,null,89843,null,93310,97555]
[null,null,null,null,null,null,30740,33670,27680,null,1279,35786,38153,41025,43721,47135,52543,60223,null,null,67715,70208,74586,null,null,79949,82460,85827,null,89846,null,93319,97556]
[null,null,null,null,null,null,30745,33671,27682,null,1280,35787,38154,41026,43723,47137,52544,60224,null,null,67716,70210,74587,null,null,79950,82470,85830,null,89847,null,93320,97556]
[null,null,null,null,null,null,30747,33673,27684,null,1285,35800,38155,41027,43725,47138,52570,60225,null,null,67720,70211,74588,null,null,79952,82478,85835,null,89848,null,93327,97556]
[null,null,null,null,null,null,30748,33677,27689,null,1289,35803,38156,41028,43726,47139,52574,60226,null,null,67730,70212,74589,null,null,79953,82500,85840,null,89849,null,93330,97557]
[null,null,null,null,null,null,30749,33679,27690,null,1290,35804,38157,41030,43728,47140,52600,60227,null,null,67735,70213,74590,null,null,79954,82505,85843,null,89850,null,93340,97557]
[null,null,null,null,null,null,30750,33680,27695,null,1296,35805,38158,41031,43730,47142,52603,60230,null,null,67740,70215,74600,null,null,79955,82513,85845,null,89853,null,93350,97560]
[null,null,null,null,null,null,30755,33681,27700,null,1298,35806,38159,41032,43731,47143,52604,60233,null,null,67750,70216,74610,null,null,79956,82517,85850,null,89858,null,93360,97563]
[null,null,null,null,null,null,30757,33682,27704,null,1299,35807,38160,41033,43733,47144,52605,60234,null,null,67754,70220,74620,null,null,79957,82530,85860,null,89860,null,93367,97564]
[null,null,null,null,null,null,30760,33683,27720,null,1310,35810,38163,41034,43734,47146,52607,60235,null,null,67755,70221,74630,null,null,79958,82532,85864,null,89865,null,93368,97566]
[null,null,null,null,null,null,30763,33687,27739,null,1320,35813,38164,41040,43735,47147,52613,60236,null,null,67756,70222,74633,null,null,79960,82534,85865,null,89866,null,93369,97570]
[null,null,null,null,null,null,30766,33690,27750,null,1330,35814,38165,41060,43736,47150,52614,60237,null,null,67760,70223,74634,null,null,79962,82540,85870,null,89867,null,93370,97570]
[null,null,null,null,null,null,30767,33693,27755,null,1340,35815,38166,41061,43739,47154,52640,60240,null,null,67767,70224,74635,null,null,79963,82545,85874,null,89868,null,93380,97573]
[null,null,null,null,null,null,30768,33700,27758,null,1376,35816,38167,41062,43740,47157,52644,60242,null,null,67768,70225,74640,null,null,79964,82550,85880,null,89869,null,93384,97574]
[null,null,null,null,null,null,30769,33710,27760,null,1377,35817,38168,41063,43745,47160,52645,60244,null,null,67769,70226,74641,null,null,79965,82553,85890,null,89870,null,93386,97575]
[null,null,null,null,null,null,30770,33720,27800,null,4640,35820,38170,41070,43746,47170,52646,60246,null,null,67770,70227,74645,null,null,79966,82554,85893,null,89880,null,93387,97575]
[null,null,null,null,null,null,30778,33730,27804,null,4650,35823,38173,41077,43747,47172,52650,60247,null,null,67778,70229,74646,null,null,79967,82560,85894,null,89884,null,93388,97577]
[null,null,null,null,null,null,30779,33737,27805,null,4660,35824,38174,41080,43748,47173,52653,60250,null,null,67779,70230,74647,null,null,79970,82563,85895,null,89885,null,93389,97577]
[null,null,null,null,null,null,30780,33739,27810,null,4700,35825,38175,41083,43749,47174,52654,60251,null,null,67780,70232,74649,null,null,79973,82564,85896,null,89886,null,93390,97577]
[null,null,null,null,null,null,30783,33740,27811,null,4710,35826,38176,41084,43750,47175,52656,60252,null,null,67790,70235,74650,null,null,79974,82580,85900,null,89887,null,93393,97578]
[null,null,null,null,null,null,30784,33748,27812,null,4730,35827,38177,41085,43753,47179,52660,60254,null,null,67800,70236,74653,null,null,79975,82590,85910,null,89888,null,93396,97578]
[null,null,null,null,null,null,30785,33749,27813,null,4739,35830,38180,41086,43754,47180,52664,60255,null,null,67802,70240,74656,null,null,79976,82591,85913,null,89889,null,93398,97579]
[null,null,null,null,null,null,30786,33750,27820,null,4800,35833,38183,41087,43759,47182,52665,60256,null,null,67803,70242,74660,null,null,79977,82592,85914,null,89890,null,93399,97580]
[null,null,null,null,null,null,30787,33759,27822,null,4810,35834,38184,41090,43760,47183,52666,60257,null,null,67804,70243,74670,null,null,79978,82600,85920,null,89893,null,93400,97580]
[null,null,null,null,null,null,30788,33760,27823,null,4815,35835,38185,41091,43762,47184,52667,60258,null,null,67805,70247,74680,null,null,79980,82603,85925,null,89895,null,93410,97583]
[null,null,null,null,null,null,30789,33765,27830,null,4830,35837,38186,41092,43763,47185,52680,60259,null,null,67806,70249,74684,null,null,79982,82604,85930,null,89896,null,93413,97585]
[null,null,null,null,null,null,30790,33768,27838,null,4840,35840,38187,41093,43764,47186,52683,60260,null,null,67808,70250,74685,null,null,79983,82605,85935,null,89897,null,93418,97586]
[null,null,null,null,null,null,30792,33769,27839,null,4870,35844,38188,41100,43767,47187,52684,60261,null,null,67809,70251,74688,null,null,79984,82607,85937,null,89898,null,93419,97587]
[null,null,null,null,null,null,30793,33770,27840,null,4890,35846,38190,41103,43770,47188,52685,60262,null,null,67812,70252,74690,null,null,79985,82608,85938,null,89899,null,93420,97590]
[null,null,null,null,null,null,30794,33777,27845,null,4899,35847,38194,41104,43773,47189,52686,60263,null,null,67815,70253,74691,null,null,79986,82610,85940,null,89910,null,93425,97596]
[null,null,null,null,null,null,30795,33778,27846,null,4909,35850,38195,41105,43774,47190,52688,60264,null,null,67816,70254,74692,null,null,79987,82613,85943,null,89912,null,93426,97600]
[null,null,null,null,null,null,30796,33779,27847,null,4910,35853,38196,41106,43775,47192,52689,60265,null,null,67817,70255,74693,null,null,79988,82614,85950,null,89913,null,93427,97604]
[null,null,null,null,null,null,30797,33800,27848,null,4918,35854,38197,41107,43780,47193,52690,60266,null,null,67819,70256,74694,null,null,79990,82616,85960,null,89914,null,93428,97606]
[null,null,null,null,null,null,30798,33810,27850,null,4919,35856,38198,41109,43782,47194,52693,60267,null,null,67824,70257,74695,null,null,79991,82617,85966,null,89917,null,93429,97608]
[null,null,null,null,null,null,30799,33814,27860,null,4920,35857,38199,41110,43783,47195,52700,60270,null,null,67825,70261,74696,null,null,79993,82620,85967,null,89918,null,93430,97609]
[null,null,null,null,null,null,30800,33815,27863,null,4929,35860,38200,41113,43784,47196,52710,60271,null,null,67826,70262,74697,null,null,79994,82625,85968,null,89920,null,93438,97610]
[null,null,null,null,null,null,30802,33816,27870,null,4930,35863,38202,41114,43785,47197,52713,60273,null,null,67828,70263,74698,null,null,79995,82628,85970,null,89922,null,93440,97614]
[null,null,null,null,null,null,30803,33818,27880,null,4938,35864,38203,41115,43786,47200,52714,60276,null,null,67830,70265,74699,null,null,79996,82630,85977,null,89923,null,93449,97614]
[null,null,null,null,null,null,30804,33820,27890,null,4939,35865,38204,41116,43787,47202,52720,60280,null,null,67835,70267,74700,null,null,79997,82635,85980,null,89925,null,93450,97614]
[null,null,null,null,null,null,30805,33823,27900,null,4940,35870,38205,41117,43788,47203,52723,60282,null,null,67836,70270,74702,null,null,79998,82636,85984,null,89928,null,93458,97615]
[null,null,null,null,null,null,30806,33824,27902,null,4950,35874,38206,41118,43790,47204,52730,60283,null,null,67838,70271,74703,null,null,null,82637,85990,null,89929,null,93460,97615]
[null,null,null,null,null,null,30807,33825,27904,null,4960,35875,38207,41120,43793,47206,52733,60284,null,null,67840,70276,74708,null,null,null,82640,85994,null,89930,null,93466,97615]
[null,null,null,null,null,null,30808,33826,27905,null,4970,35876,38210,41122,43794,47207,52740,60285,null,null,67842,70277,74710,null,null,null,82642,null,null,89938,null,93467,97615]
[null,null,null,null,null,null,30809,33827,27906,null,4980,35877,38213,41123,43795,47210,52743,60286,null,null,67844,70280,74714,null,null,null,82643,null,null,89939,null,93468,97616]
[null,null,null,null,null,null,30810,33829,27907,null,5000,35880,38214,41124,43797,47212,52750,60287,null,null,67845,70281,74716,null,null,null,82644,null,null,89940,null,93470,97620]
[null,null,null,null,null,null,30812,33830,27908,null,5010,35883,38215,41125,43800,47213,52753,60290,null,null,67846,70282,74720,null,null,null,82646,null,null,89942,null,93477,97623]
[null,null,null,null,null,null,30813,33834,27911,null,5020,35884,38216,41126,43802,47214,52754,60293,null,null,67847,70283,74723,null,null,null,82647,null,null,89943,null,93478,97623]
[null,null,null,null,null,null,30814,33836,27913,null,5030,35885,38217,41127,43803,47215,52755,60294,null,null,67849,70284,74724,null,null,null,82648,null,null,89945,null,93479,97624]
[null,null,null,null,null,null,30815,33839,27914,null,5050,35886,38220,41130,43804,47216,52756,60295,null,null,67850,70286,74725,null,null,null,82650,null,null,89950,null,93480,97624]
[null,null,null,null,null,null,30816,33840,27915,null,5100,35887,38223,41133,43806,47217,52757,60297,null,null,67852,70287,74727,null,null,null,82653,null,null,89953,null,93484,97625]
[null,null,null,null,null,null,30817,33846,27916,null,5110,35888,38224,41134,43807,47218,52760,60300,null,null,67853,70288,74728,null,null,null,82655,null,null,89955,null,93485,97625]
[null,null,null,null,null,null,30818,33848,27917,null,5118,35890,38225,41135,43808,47220,52763,60320,null,null,67854,70289,74729,null,null,null,82656,null,null,89956,null,93486,97625]
[null,null,null,null,null,null,30820,33850,27918,null,5119,35893,38226,41136,43810,47223,52764,60322,null,null,67855,70290,74730,null,null,null,82658,null,null,89960,null,93487,97625]
[null,null,null,null,null,null,30823,33855,27920,null,5120,35894,38227,41137,43815,47224,52765,60324,null,null,67856,70292,74732,null,null,null,82660,null,null,89963,null,93489,97625]
[null,null,null,null,null,null,30824,33856,27923,null,5129,35895,38240,41140,43816,47225,52766,60330,null,null,67857,70293,74733,null,null,null,82663,null,null,89965,null,93490,97626]
[null,null,null,null,null,null,30825,33857,27924,null,5200,35896,38243,41144,43817,47226,52767,60340,null,null,67858,70294,74734,null,null,null,82666,null,null,89966,null,93498,97626]
[null,null,null,null,null,null,30826,33858,27925,null,5219,35900,38244,41145,43820,47227,52768,60350,null,null,67860,70296,74735,null,null,null,82667,null,null,89967,null,93499,97627]
[null,null,null,null,null,null,30827,33860,27926,null,5220,35901,38245,41146,43823,47228,52769,60360,null,null,67863,70298,74736,null,null,null,82670,null,null,89968,null,93520,97630]
[null,null,null,null,null,null,30828,33863,27927,null,5230,35903,38246,41147,43824,47229,52770,60364,null,null,67864,70300,74737,null,null,null,82675,null,null,89969,null,93523,97634]
[null,null,null,null,null,null,30829,33868,27930,null,5240,35904,38247,41150,43825,47230,52773,60365,null,null,67865,70304,74740,null,null,null,82677,null,null,89970,null,93524,97636]
[null,null,null,null,null,null,30830,33869,27933,null,5260,35905,38250,41153,43830,47232,52774,60370,null,null,67866,70305,74741,null,null,null,82680,null,null,null,null,93525,97640]
[null,null,null,null,null,null,30832,33870,27934,null,5269,35907,38253,41154,43831,47235,52775,60373,null,null,67867,70306,74750,null,null,null,82684,null,null,null,null,93526,97645]
[null,null,null,null,null,null,30833,33873,27935,null,9400,35910,38254,41156,43832,47236,52776,60374,null,null,67868,70307,74755,null,null,null,82685,null,null,null,null,93527,97645]
[null,null,null,null,null,null,30834,33879,27936,null,9410,35911,38255,41157,43833,47237,52777,60376,null,null,67870,70308,74760,null,null,null,82686,null,null,null,null,93530,97645]
[null,null,null,null,null,null,30835,33880,27937,null,9420,35917,38256,41160,43834,47238,52778,60377,null,null,67872,70309,74770,null,null,null,82700,null,null,null,null,93532,97646]
[null,null,null,null,null,null,30836,33884,27940,null,9429,35918,38257,41161,43835,47239,52779,60378,null,null,67873,70310,74773,null,null,null,82702,null,null,null,null,93533,97647]
[null,null,null,null,null,null,30837,33885,27943,null,9430,35920,38260,41163,43836,47240,52780,60379,null,null,67874,70312,74777,null,null,null,82703,null,null,null,null,93534,97650]
[null,null,null,null,null,null,30838,33886,27944,null,9438,35922,38263,41164,43837,47243,52783,60380,null,null,67875,70313,74780,null,null,null,82704,null,null,null,null,93535,97653]
[null,null,null,null,null,null,30839,33890,27945,null,9440,35923,38265,41165,43838,47244,52784,60384,null,null,67876,70315,74790,null,null,null,82705,null,null,null,null,93536,97653]
[null,null,null,null,null,null,30840,33896,27946,null,9450,35925,38269,41166,43840,47245,52785,60385,null,null,67877,70317,74792,null,null,null,82706,null,null,null,null,93537,97654]
[null,null,null,null,null,null,30843,33898,27948,null,9460,35930,38271,41167,43841,47246,52786,60390,null,null,67878,70318,74794,null,null,null,82707,null,null,null,null,93538,97654]
[null,null,null,null,null,null,30844,33900,27950,null,9470,35932,38272,41168,43844,47247,52787,60393,null,null,67880,70319,74795,null,null,null,82708,null,null,null,null,93540,97654]
[null,null,null,null,null,null,30845,33903,27953,null,9479,35937,38273,41169,43845,47248,52788,60394,null,null,67881,70320,74796,null,null,null,82710,null,null,null,null,93542,97654]
[null,null,null,null,null,null,30846,33904,27954,null,9480,35938,38280,41170,43846,47249,52789,60400,null,null,67884,70323,74797,null,null,null,82713,null,null,null,null,93543,97654]
[null,null,null,null,null,null,30847,33905,27955,null,9500,35940,38290,41171,43848,47250,52790,60401,null,null,67885,70324,74798,null,null,null,82720,null,null,null,null,93544,97654]
[null,null,null,null,null,null,30849,33906,27956,null,9510,35942,38291,41172,43850,47252,52793,60403,null,null,67890,70326,74800,null,null,null,82721,null,null,null,null,93545,97654]
[null,null,null,null,null,null,30850,33907,27957,null,9520,35944,38293,41173,43851,47253,52794,60410,null,null,67893,70327,74801,null,null,null,82723,null,null,null,null,93546,97654]
[null,null,null,null,null,null,30851,33910,27958,null,9530,35945,38294,41179,43852,47254,52795,60413,null,null,67895,70328,74802,null,null,null,82724,null,null,null,null,93547,97654]
[null,null,null,null,null,null,30852,33913,27960,null,9550,35947,38295,41180,43853,47256,52796,60414,null,null,67896,70329,74803,null,null,null,82725,null,null,null,null,93548,97654]
[null,null,null,null,null,null,30853,33914,27965,null,9560,35950,38300,41190,43854,47258,52797,60417,null,null,67897,70330,74806,null,null,null,82726,null,null,null,null,93549,97655]
[null,null,null,null,null,null,30854,33915,27966,null,9570,35953,38309,41191,43855,47259,52798,60420,null,null,67898,70331,74807,null,null,null,82727,null,null,null,null,93550,97660]
[null,null,null,null,null,null,30855,33916,27967,null,9578,35954,38310,41193,43859,47260,52799,60421,null,null,67899,70332,74808,null,null,null,82730,null,null,null,null,93552,97666]
[null,null,null,null,null,null,30858,33917,27970,null,9600,35955,38312,41194,43860,47263,52900,60422,null,null,67900,70333,74810,null,null,null,82733,null,null,null,null,93553,97666]
[null,null,null,null,null,null,30860,33920,27974,null,9608,35956,38314,41197,43862,47264,52909,60423,null,null,67902,70334,74813,null,null,null,82734,null,null,null,null,93556,97670]
[null,null,null,null,null,null,30861,33922,27975,null,9609,35960,38315,41198,43863,47265,52910,60424,null,null,67903,70335,74815,null,null,null,82739,null,null,null,null,93557,97675]
[null,null,null,null,null,null,30862,33923,27976,null,9620,35963,38317,41199,43864,47267,52915,60425,null,null,67904,70336,74816,null,null,null,82740,null,null,null,null,93558,97676]
[null,null,null,null,null,null,30866,33924,27977,null,9630,35965,38320,41200,43865,47268,52916,60430,null,null,67905,70337,74817,null,null,null,82741,null,null,null,null,93559,97677]
[null,null,null,null,null,null,30867,33925,27980,null,9637,35966,38322,41202,43866,47269,52918,60431,null,null,67906,70338,74818,null,null,null,82743,null,null,null,null,93560,97677]
[null,null,null,null,null,null,30868,33928,27983,null,9638,35970,38324,41204,43867,47270,52919,60432,null,null,67907,70340,74820,null,null,null,82744,null,null,null,null,93562,97677]
[null,null,null,null,null,null,30869,33929,27984,null,9640,35973,38325,41205,43870,47272,52920,60433,null,null,67908,70341,74826,null,null,null,82745,null,null,null,null,93564,97677]
[null,null,null,null,null,null,30870,33930,27985,null,9648,35974,38329,41206,43873,47274,52923,60434,null,null,67912,70343,74830,null,null,null,82747,null,null,null,null,93566,97677]
[null,null,null,null,null,null,30871,33935,27986,null,13600,35975,38330,41207,43874,47275,52924,60435,null,null,67913,70344,74835,null,null,null,82750,null,null,null,null,93568,97678]
[null,null,null,null,null,null,30874,33936,27987,null,13610,35977,38332,41220,43875,47276,52925,60440,null,null,67914,70346,74838,null,null,null,82755,null,null,null,null,93569,97678]
[null,null,null,null,null,null,30875,33939,27988,null,13625,35980,38333,41222,43876,47280,52926,60442,null,null,67915,70347,74840,null,null,null,82758,null,null,null,null,93570,97680]
[null,null,null,null,null,null,30876,33940,27989,null,13630,35983,38334,41230,43880,47282,52927,60443,null,null,67916,70350,74842,null,null,null,82760,null,null,null,null,93571,97684]
[null,null,null,null,null,null,30877,33943,27990,null,13640,35984,38335,41240,43882,47283,52928,60445,null,null,67917,70351,74844,null,null,null,82763,null,null,null,null,93575,97686]
[null,null,null,null,null,null,30880,33944,27991,null,13700,35986,38337,41241,43883,47285,52929,60446,null,null,67920,70353,74846,null,null,null,82764,null,null,null,null,93576,97690]
[null,null,null,null,null,null,30881,33945,27992,null,14000,35987,38338,41250,43884,47288,52930,60447,null,null,67921,70354,74847,null,null,null,82765,null,null,null,null,93577,97694]
[null,null,null,null,null,null,30883,33946,27993,null,14010,null,38342,41251,43885,47290,52934,60460,null,null,67922,70355,74850,null,null,null,82770,null,null,null,null,93578,97695]
[null,null,null,null,null,null,30884,33947,27994,null,14020,null,38343,41260,43890,47293,52936,60464,null,null,67923,70356,74853,null,null,null,82773,null,null,null,null,93579,97697]
[null,null,null,null,null,null,30885,33950,27995,null,14030,null,38344,41270,43893,47294,52937,60465,null,null,67924,70360,74855,null,null,null,82774,null,null,null,null,93580,97700]
[null,null,null,null,null,null,30886,33953,27996,null,14039,null,38345,41272,43894,47295,52938,60466,null,null,67925,70363,74859,null,null,null,82775,null,null,null,null,93585,97700]
[null,null,null,null,null,null,30890,33954,27997,null,14040,null,38346,41280,43895,47296,52939,60467,null,null,67926,70364,74860,null,null,null,82776,null,null,null,null,93588,97702]
[null,null,null,null,null,null,30892,33955,null,null,14049,null,38349,41300,43896,47298,52940,60468,null,null,67928,70365,74863,null,null,null,82777,null,null,null,null,93590,97702]
[null,null,null,null,null,null,30893,33956,null,null,14050,null,38350,41302,43897,47300,52945,60470,null,null,67930,70366,74864,null,null,null,82780,null,null,null,null,93597,97702]
[null,null,null,null,null,null,30894,33957,null,null,14060,null,38356,41303,43900,47302,52946,60473,null,null,67931,70367,74865,null,null,null,82783,null,null,null,null,93600,97702]
[null,null,null,null,null,null,30895,33960,null,null,14070,null,38357,41304,43902,47303,52947,60474,null,null,67932,70368,74867,null,null,null,82786,null,null,null,null,93603,97702]
[null,null,null,null,null,null,30896,33961,null,null,14080,null,38358,41305,43903,47308,52948,60475,null,null,67933,70370,74868,null,null,null,82787,null,null,null,null,93604,97702]
[null,null,null,null,null,null,30897,33962,null,null,14090,null,38359,41310,43904,47309,52949,60476,null,null,67934,70371,74870,null,null,null,82788,null,null,null,null,93605,97702]
[null,null,null,null,null,null,30898,33963,null,null,14100,null,38360,41311,43905,47310,52950,60477,null,null,67935,70372,74872,null,null,null,82790,null,null,null,null,93606,97702]
[null,null,null,null,null,null,30900,33964,null,null,14108,null,38362,41312,43906,47313,52953,60480,null,null,67936,70373,74874,null,null,null,82793,null,null,null,null,93607,97702]
[null,null,null,null,null,null,30902,33969,null,null,14110,null,38373,41320,43907,47314,52957,60483,null,null,67937,70380,74875,null,null,null,82794,null,null,null,null,93608,97702]
[null,null,null,null,null,null,30903,33970,null,null,14120,null,38374,41322,43908,47315,52958,60484,null,null,67938,70382,74876,null,null,null,82795,null,null,null,null,93610,97702]
[null,null,null,null,null,null,30904,33973,null,null,14140,null,38375,41327,43909,47320,52959,60485,null,null,67940,70383,74880,null,null,null,82796,null,null,null,null,93613,97702]
[null,null,null,null,null,null,30905,33974,null,null,14150,null,38383,41328,43915,47325,52960,60486,null,null,67943,70384,74884,null,null,null,82797,null,null,null,null,93620,97702]
[null,null,null,null,null,null,30906,33975,null,null,14160,null,38390,41330,43916,47327,52965,60490,null,null,67944,70390,74885,null,null,null,82800,null,null,null,null,93623,97702]
[null,null,null,null,null,null,30907,33976,null,null,14200,null,38395,41331,43917,47330,52966,60492,null,null,67945,70391,74886,null,null,null,82802,null,null,null,null,93624,97702]
[null,null,null,null,null,null,30910,33977,null,null,14208,null,38400,41340,43918,47334,52967,60493,null,null,67946,70392,74887,null,null,null,82803,null,null,null,null,93625,97702]
[null,null,null,null,null,null,30911,33978,null,null,14209,null,38403,41347,43919,47335,52968,60494,null,null,67947,70393,74889,null,null,null,82804,null,null,null,null,93626,97703]
[null,null,null,null,null,null,30913,33980,null,null,14210,null,38404,41348,43920,47336,52970,60495,null,null,67948,70400,74890,null,null,null,82805,null,null,null,null,93627,97703]
[null,null,null,null,null,null,30914,33983,null,null,14219,null,38405,41349,43921,47337,52975,60496,null,null,67950,70403,74893,null,null,null,82806,null,null,null,null,93628,97703]
[null,null,null,null,null,null,30915,33984,null,null,14220,null,38406,41350,43922,47338,52976,60497,null,null,67953,70404,74894,null,null,null,82807,null,null,null,null,93629,97703]
[null,null,null,null,null,null,30916,33985,null,null,14230,null,38407,41352,43923,47339,52977,60500,null,null,67954,70405,74895,null,null,null,82808,null,null,null,null,93633,97703]
[null,null,null,null,null,null,30917,33986,null,null,14239,null,38410,41353,43924,47340,52978,60501,null,null,67955,70406,74896,null,null,null,82809,null,null,null,null,93634,97703]
[null,null,null,null,null,null,30918,33987,null,null,14240,null,38413,41354,43930,47343,52979,60520,null,null,67956,70407,74897,null,null,null,82810,null,null,null,null,93635,97703]
[null,null,null,null,null,null,30919,33990,null,null,14248,null,38414,41355,43933,47344,52980,60521,null,null,67957,70408,74900,null,null,null,82813,null,null,null,null,93636,97704]
[null,null,null,null,null,null,30920,33991,null,null,14250,null,38415,41356,43934,47347,52985,60522,null,null,67958,70410,74904,null,null,null,82814,null,null,null,null,93637,97704]
[null,null,null,null,null,null,30923,33992,null,null,14260,null,38416,41380,43935,47348,52986,60523,null,null,67959,70411,74905,null,null,null,82817,null,null,null,null,93638,97704]
[null,null,null,null,null,null,30924,33993,null,null,14266,null,38417,41381,43937,47350,52987,60524,null,null,67960,70412,74906,null,null,null,82820,null,null,null,null,93640,97704]
[null,null,null,null,null,null,30925,33995,null,null,14267,null,38420,41384,43940,47359,52988,60525,null,null,67965,70417,74907,null,null,null,82823,null,null,null,null,93641,97705]
[null,null,null,null,null,null,30926,33996,null,null,14268,null,38423,41390,43941,47360,52989,60526,null,null,67966,70420,74908,null,null,null,82824,null,null,null,null,93643,97705]
[null,null,null,null,null,null,30927,33997,null,null,1000,null,38424,41391,43943,47368,52990,60529,null,null,67972,70423,74909,null,null,null,82825,null,null,null,null,93644,97705]
[null,null,null,null,null,null,30930,null,null,null,1010,null,38425,41392,43944,47369,52994,60530,null,null,67973,70424,74910,null,null,null,82826,null,null,null,null,93645,97705]
[null,null,null,null,null,null,30933,null,null,null,1020,null,38426,41400,43945,47370,52995,60531,null,null,67974,70426,74915,null,null,null,82827,null,null,null,null,93646,97705]
[null,null,null,null,null,null,30934,null,null,null,1030,null,38427,41402,43946,47373,52996,60532,null,null,67975,70428,74917,null,null,null,82830,null,null,null,null,93647,97706]
[null,null,null,null,null,null,30935,null,null,null,1040,null,38430,41403,43947,47374,52997,60533,null,null,67976,70430,74920,null,null,null,82832,null,null,null,null,93650,97706]
[null,null,null,null,null,null,30936,null,null,null,1049,null,38433,41404,43948,47378,52998,60534,null,null,67977,70434,74927,null,null,null,82833,null,null,null,null,93653,97706]
[null,null,null,null,null,null,30937,null,null,null,1050,null,38434,41405,43949,47380,53000,60536,null,null,67978,70435,74928,null,null,null,82834,null,null,null,null,93654,97706]
[null,null,null,null,null,null,30940,null,null,null,1060,null,38435,41406,43950,47383,53010,60537,null,null,67980,70436,74930,null,null,null,82835,null,null,null,null,93655,97706]
[null,null,null,null,null,null,30943,null,null,null,1070,null,38436,41407,43953,47384,53030,60538,null,null,67982,70437,74935,null,null,null,82839,null,null,null,null,93656,97706]
[null,null,null,null,null,null,30944,null,null,null,1080,null,38437,41408,43954,47386,53040,60539,null,null,67983,70439,74940,null,null,null,82850,null,null,null,null,93657,97706]
[null,null,null,null,null,null,30945,null,null,null,1089,null,38440,41410,43955,47398,53050,60540,null,null,67984,70440,74941,null,null,null,82853,null,null,null,null,93660,97706]
[null,null,null,null,null,null,30946,null,null,null,1090,null,38443,41423,43956,47400,53060,60542,null,null,67985,70442,74942,null,null,null,82860,null,null,null,null,93662,97706]
[null,null,null,null,null,null,30950,null,null,null,1100,null,38445,41424,43960,47410,53070,60544,null,null,67986,70445,74943,null,null,null,82863,null,null,null,null,93664,97706]
[null,null,null,null,null,null,30953,null,null,null,1109,null,38446,41425,43961,47420,53100,60545,null,null,67990,70446,74944,null,null,null,82864,null,null,null,null,93666,97706]
[null,null,null,null,null,null,30954,null,null,null,1110,null,38447,41426,43963,47423,53110,60547,null,null,67996,70450,74945,null,null,null,82865,null,null,null,null,93667,97706]
[null,null,null,null,null,null,30955,null,null,null,1120,null,38450,41427,43964,47425,53115,60550,null,null,null,70453,74946,null,null,null,82866,null,null,null,null,93668,97706]
[null,null,null,null,null,null,30956,null,null,null,1125,null,38453,41428,43965,47430,53116,60553,null,null,null,70456,74947,null,null,null,82870,null,null,null,null,93670,97706]
[null,null,null,null,null,null,30957,null,null,null,1130,null,38454,41430,43966,47433,53117,60554,null,null,null,70458,74949,null,null,null,82871,null,null,null,null,93671,97706]
[null,null,null,null,null,null,30960,null,null,null,1139,null,38455,41433,43970,47440,53119,60555,null,null,null,70460,74950,null,null,null,82872,null,null,null,null,93672,97707]
[null,null,null,null,null,null,30963,null,null,null,1140,null,38456,41434,43973,47443,53120,60556,null,null,null,70461,74955,null,null,null,82874,null,null,null,null,93675,97707]
[null,null,null,null,null,null,30964,null,null,null,1150,null,38457,41435,43974,47450,53124,60557,null,null,null,70464,74956,null,null,null,82875,null,null,null,null,93676,97707]
[null,null,null,null,null,null,30965,null,null,null,1160,null,38460,41436,43975,47457,53125,60560,null,null,null,70467,74957,null,null,null,82876,null,null,null,null,93680,97707]
[null,null,null,null,null,null,30966,null,null,null,1170,null,38463,41437,43976,47460,53126,60563,null,null,null,70470,74960,null,null,null,82877,null,null,null,null,93683,97707]
[null,null,null,null,null,null,30967,null,null,null,1180,null,38464,41438,43977,47463,53127,60564,null,null,null,70474,74963,null,null,null,82880,null,null,null,null,93684,97707]
[null,null,null,null,null,null,30970,null,null,null,1200,null,38465,41439,43980,47470,53128,60565,null,null,null,70477,74964,null,null,null,82883,null,null,null,null,93685,97707]
[null,null,null,null,null,null,30973,null,null,null,1210,null,38466,41440,43983,47472,53129,60566,null,null,null,70478,74965,null,null,null,82884,null,null,null,null,93687,97707]
[null,null,null,null,null,null,30974,null,null,null,1219,null,38467,41441,43984,47473,53130,60567,null,null,null,70479,74966,null,null,null,82885,null,null,null,null,93688,97707]
[null,null,null,null,null,null,30975,null,null,null,null,null,38470,41442,43985,47474,53138,60570,null,null,null,70480,74970,null,null,null,82886,null,null,null,null,93689,97710]
[null,null,null,null,null,null,30976,null,null,null,null,null,38473,41443,43986,47476,53140,60571,null,null,null,70482,74973,null,null,null,82887,null,null,null,null,93690,97710]
[null,null,null,null,null,null,30977,null,null,null,null,null,38474,41444,43987,47479,53150,60573,null,null,null,70484,74974,null,null,null,82900,null,null,null,null,93692,97710]
[null,null,null,null,null,null,30980,null,null,null,null,null,38475,41446,43988,47480,53160,60574,null,null,null,70486,74975,null,null,null,82902,null,null,null,null,93693,97710]
[null,null,null,null,null,null,30982,null,null,null,null,null,38476,41450,43990,47490,53170,60575,null,null,null,70487,74976,null,null,null,82904,null,null,null,null,93694,97710]
[null,null,null,null,null,null,30983,null,null,null,null,null,38477,41451,43991,47500,53177,60576,null,null,null,70488,74977,null,null,null,82905,null,null,null,null,93695,97710]
[null,null,null,null,null,null,30984,null,null,null,null,null,38480,41452,43993,47503,53178,60577,null,null,null,70490,74978,null,null,null,82906,null,null,null,null,93696,97710]
[null,null,null,null,null,null,30985,null,null,null,null,null,38483,41460,43994,47504,53179,60578,null,null,null,70494,74979,null,null,null,82907,null,null,null,null,93697,97710]
[null,null,null,null,null,null,30986,null,null,null,null,null,38484,41461,43995,47505,53200,60580,null,null,null,70495,74980,null,null,null,82909,null,null,null,null,93698,97710]
[null,null,null,null,null,null,30987,null,null,null,null,null,38485,41462,43996,47506,53215,60581,null,null,null,70496,74986,null,null,null,82910,null,null,null,null,93699,97710]
[null,null,null,null,null,null,30988,null,null,null,null,null,38486,41463,43997,47507,53216,60582,null,null,null,70497,74990,null,null,null,82912,null,null,null,null,93700,97710]
[null,null,null,null,null,null,30990,null,null,null,null,null,38487,41470,43998,47510,53217,60583,null,null,null,70498,74993,null,null,null,82913,null,null,null,null,93710,97710]
[null,null,null,null,null,null,30992,null,null,null,null,null,38488,41471,null,47512,53218,60584,null,null,null,70500,74995,null,null,null,82916,null,null,null,null,93714,97710]
[null,null,null,null,null,null,30993,null,null,null,null,null,38490,41480,null,47513,53219,60585,null,null,null,70503,74996,null,null,null,82917,null,null,null,null,93715,97710]
[null,null,null,null,null,null,30994,null,null,null,null,null,38493,41481,null,47514,53220,60586,null,null,null,70504,74997,null,null,null,82918,null,null,null,null,93716,97712]
[null,null,null,null,null,null,30995,null,null,null,null,null,38494,41490,null,47515,53224,60587,null,null,null,70505,74998,null,null,null,82920,null,null,null,null,93720,97713]
[null,null,null,null,null,null,30996,null,null,null,null,null,38495,41491,null,47516,53227,60590,null,null,null,70506,75000,null,null,null,82923,null,null,null,null,93721,97713]
[null,null,null,null,null,null,30997,null,null,null,null,null,38496,41498,null,47517,53228,60593,null,null,null,70507,75010,null,null,null,82925,null,null,null,null,93723,97713]
[null,null,null,null,null,null,null,null,null,null,null,null,38497,41499,null,47519,53229,60594,null,null,null,70508,75012,null,null,null,82930,null,null,null,null,93724,97713]
[null,null,null,null,null,null,null,null,null,null,null,null,38498,41500,null,47520,53230,60595,null,null,null,70510,75014,null,null,null,82933,null,null,null,null,93725,97713]
[null,null,null,null,null,null,null,null,null,null,null,null,38499,41503,null,47522,53237,60596,null,null,null,70513,75016,null,null,null,82934,null,null,null,null,93726,97713]
[null,null,null,null,null,null,null,null,null,null,null,null,38500,41504,null,47524,53239,60597,null,null,null,70514,75020,null,null,null,82935,null,null,null,null,93730,97713]
[null,null,null,null,null,null,null,null,null,null,null,null,38503,41505,null,47525,53240,60600,null,null,null,70515,75021,null,null,null,82937,null,null,null,null,93732,97713]
[null,null,null,null,null,null,null,null,null,null,null,null,38504,41506,null,47526,53247,60610,null,null,null,70516,75023,null,null,null,82940,null,null,null,null,93733,97713]
[null,null,null,null,null,null,null,null,null,null,null,null,38505,41507,null,47527,53248,60615,null,null,null,70517,75024,null,null,null,82943,null,null,null,null,93734,97713]
[null,null,null,null,null,null,null,null,null,null,null,null,38506,41513,null,47528,53250,60616,null,null,null,70520,75025,null,null,null,82945,null,null,null,null,93735,97713]
[null,null,null,null,null,null,null,null,null,null,null,null,38507,41515,null,47530,53260,60619,null,null,null,70523,75026,null,null,null,82950,null,null,null,null,93737,97714]
[null,null,null,null,null,null,null,null,null,null,null,null,38510,41516,null,47532,53270,60620,null,null,null,70529,75029,null,null,null,82953,null,null,null,null,93740,97714]
[null,null,null,null,null,null,null,null,null,null,null,null,38513,41517,null,47533,53278,60626,null,null,null,70530,75030,null,null,null,82954,null,null,null,null,93743,97715]
[null,null,null,null,null,null,null,null,null,null,null,null,38514,41520,null,47534,53279,60627,null,null,null,70531,75033,null,null,null,82955,null,null,null,null,93744,97715]
[null,null,null,null,null,null,null,null,null,null,null,null,38515,41523,null,47535,53280,60628,null,null,null,70532,75035,null,null,null,82956,null,null,null,null,93745,97715]
[null,null,null,null,null,null,null,null,null,null,null,null,38516,41524,null,47536,53283,60630,null,null,null,70533,75036,null,null,null,82960,null,null,null,null,93746,97715]
[null,null,null,null,null,null,null,null,null,null,null,null,38517,41525,null,47537,53290,60633,null,null,null,70534,75037,null,null,null,82963,null,null,null,null,93747,97715]
[null,null,null,null,null,null,null,null,null,null,null,null,38520,41527,null,47539,53296,60637,null,null,null,70536,75038,null,null,null,82965,null,null,null,null,93748,97715]
[null,null,null,null,null,null,null,null,null,null,null,null,38523,41530,null,47540,53297,60639,null,null,null,70540,75039,null,null,null,82966,null,null,null,null,93749,97715]
[null,null,null,null,null,null,null,null,null,null,null,null,38524,41533,null,47542,53298,60640,null,null,null,70546,75040,null,null,null,82967,null,null,null,null,93750,97715]
[null,null,null,null,null,null,null,null,null,null,null,null,38525,41535,null,47545,53300,60650,null,null,null,70547,75043,null,null,null,82968,null,null,null,null,93760,97715]
[null,null,null,null,null,null,null,null,null,null,null,null,38526,41536,null,47546,53309,60654,null,null,null,70550,75044,null,null,null,82969,null,null,null,null,93761,97715]
[null,null,null,null,null,null,null,null,null,null,null,null,38527,41537,null,47547,53310,60655,null,null,null,70560,75045,null,null,null,82970,null,null,null,null,93763,97715]
[null,null,null,null,null,null,null,null,null,null,null,null,38530,41540,null,47548,53320,60656,null,null,null,70561,75046,null,null,null,82973,null,null,null,null,93764,97715]
[null,null,null,null,null,null,null,null,null,null,null,null,38533,41541,null,47549,53329,60658,null,null,null,70563,75047,null,null,null,82974,null,null,null,null,93766,97715]
[null,null,null,null,null,null,null,null,null,null,null,null,38534,41542,null,47550,53330,60660,null,null,null,70565,75049,null,null,null,82975,null,null,null,null,93769,97715]
[null,null,null,null,null,null,null,null,null,null,null,null,38535,41545,null,47557,53338,60663,null,null,null,70569,75050,null,null,null,82976,null,null,null,null,93780,97716]
[null,null,null,null,null,null,null,null,null,null,null,null,38536,41547,null,47560,53339,60664,null,null,null,70570,75052,null,null,null,82980,null,null,null,null,93783,97716]
[null,null,null,null,null,null,null,null,null,null,null,null,38537,41550,null,47563,53340,60667,null,null,null,70575,75053,null,null,null,82983,null,null,null,null,93787,97716]
[null,null,null,null,null,null,null,null,null,null,null,null,38540,41551,null,47564,53348,60670,null,null,null,70580,75054,null,null,null,82984,null,null,null,null,93789,97716]
[null,null,null,null,null,null,null,null,null,null,null,null,38542,41552,null,47565,53350,60673,null,null,null,70586,75055,null,null,null,82985,null,null,null,null,93800,97716]
[null,null,null,null,null,null,null,null,null,null,null,null,38543,41554,null,47566,53370,60674,null,null,null,70588,75056,null,null,null,82990,null,null,null,null,93803,97716]
[null,null,null,null,null,null,null,null,null,null,null,null,38544,41560,null,47570,53378,60676,null,null,null,70590,75057,null,null,null,82993,null,null,null,null,93808,97716]
[null,null,null,null,null,null,null,null,null,null,null,null,38545,41570,null,47572,53390,60677,null,null,null,70595,75058,null,null,null,82994,null,null,null,null,93810,97716]
[null,null,null,null,null,null,null,null,null,null,null,null,38550,41576,null,47573,53398,60680,null,null,null,70600,75059,null,null,null,82995,null,null,null,null,93813,97716]
[null,null,null,null,null,null,null,null,null,null,null,null,38553,41600,null,47574,53400,60683,null,null,null,70610,75060,null,null,null,82996,null,null,null,null,93814,97716]
[null,null,null,null,null,null,null,null,null,null,null,null,38554,41603,null,47575,53410,60684,null,null,null,70612,75063,null,null,null,null,null,null,null,null,93815,97716]
[null,null,null,null,null,null,null,null,null,null,null,null,38555,41605,null,47576,53420,60685,null,null,null,70613,75064,null,null,null,null,null,null,null,null,93816,97717]
[null,null,null,null,null,null,null,null,null,null,null,null,38556,41606,null,47577,53425,60689,null,null,null,70614,75065,null,null,null,null,null,null,null,null,93820,97717]
[null,null,null,null,null,null,null,null,null,null,null,null,38557,41608,null,47580,53426,60690,null,null,null,70615,75066,null,null,null,null,null,null,null,null,93826,97717]
[null,null,null,null,null,null,null,null,null,null,null,null,38560,41610,null,47584,53427,60693,null,null,null,70620,75069,null,null,null,null,null,null,null,null,93827,97717]
[null,null,null,null,null,null,null,null,null,null,null,null,38563,41613,null,47585,53428,60694,null,null,null,70630,75070,null,null,null,null,null,null,null,null,93828,97717]
[null,null,null,null,null,null,null,null,null,null,null,null,38564,41614,null,47586,53430,60695,null,null,null,70633,75071,null,null,null,null,null,null,null,null,93829,97717]
[null,null,null,null,null,null,null,null,null,null,null,null,38565,41615,null,47587,53440,60696,null,null,null,70640,75072,null,null,null,null,null,null,null,null,93830,97717]
[null,null,null,null,null,null,null,null,null,null,null,null,38566,41616,null,47588,53450,60697,null,null,null,70650,75073,null,null,null,null,null,null,null,null,93833,97720]
[null,null,null,null,null,null,null,null,null,null,null,null,38567,41617,null,47590,53458,60698,null,null,null,70660,75074,null,null,null,null,null,null,null,null,93834,97723]
[null,null,null,null,null,null,null,null,null,null,null,null,38570,41620,null,47592,53459,60699,null,null,null,70664,75080,null,null,null,null,null,null,null,null,93835,97726]
[null,null,null,null,null,null,null,null,null,null,null,null,38573,41623,null,47593,53460,60700,null,null,null,70665,75081,null,null,null,null,null,null,null,null,93836,97730]
[null,null,null,null,null,null,null,null,null,null,null,null,38574,41624,null,47595,53470,60710,null,null,null,70666,75082,null,null,null,null,null,null,null,null,93837,97730]
[null,null,null,null,null,null,null,null,null,null,null,null,38575,41630,null,47596,53489,60713,null,null,null,70670,75083,null,null,null,null,null,null,null,null,93840,97733]
[null,null,null,null,null,null,null,null,null,null,null,null,38576,41633,null,47597,53490,60714,null,null,null,70680,75084,null,null,null,null,null,null,null,null,93843,97734]
[null,null,null,null,null,null,null,null,null,null,null,null,38577,41634,null,47599,53500,60715,null,null,null,70690,75087,null,null,null,null,null,null,null,null,93844,97734]
[null,null,null,null,null,null,null,null,null,null,null,null,38578,41636,null,47600,53519,60717,null,null,null,70701,75088,null,null,null,null,null,null,null,null,93845,97734]
[null,null,null,null,null,null,null,null,null,null,null,null,38580,41637,null,47610,53520,60720,null,null,null,70702,75089,null,null,null,null,null,null,null,null,93846,97739]
[null,null,null,null,null,null,null,null,null,null,null,null,38583,41640,null,47614,53529,60724,null,null,null,70703,75090,null,null,null,null,null,null,null,null,93847,97740]
[null,null,null,null,null,null,null,null,null,null,null,null,38584,41643,null,47620,53530,60725,null,null,null,70704,75092,null,null,null,null,null,null,null,null,93860,97743]
[null,null,null,null,null,null,null,null,null,null,null,null,38585,41644,null,47622,53533,60726,null,null,null,70705,75093,null,null,null,null,null,null,null,null,93880,97743]
[null,null,null,null,null,null,null,null,null,null,null,null,38586,41645,null,47630,53550,60727,null,null,null,70706,75095,null,null,null,null,null,null,null,null,93882,97743]
[null,null,null,null,null,null,null,null,null,null,null,null,38587,41646,null,47634,53560,60728,null,null,null,70707,75096,null,null,null,null,null,null,null,null,93883,97743]
[null,null,null,null,null,null,null,null,null,null,null,null,38590,41650,null,47635,53569,60730,null,null,null,70710,75097,null,null,null,null,null,null,null,null,93884,97743]
[null,null,null,null,null,null,null,null,null,null,null,null,38593,41654,null,47636,53570,60734,null,null,null,70711,75098,null,null,null,null,null,null,null,null,93885,97743]
[null,null,null,null,null,null,null,null,null,null,null,null,38594,41655,null,47637,53580,60735,null,null,null,70713,75100,null,null,null,null,null,null,null,null,93890,97744]
[null,null,null,null,null,null,null,null,null,null,null,null,38595,41656,null,47639,53598,60736,null,null,null,70715,75110,null,null,null,null,null,null,null,null,93892,97744]
[null,null,null,null,null,null,null,null,null,null,null,null,38596,41657,null,47640,53640,60737,null,null,null,70716,75112,null,null,null,null,null,null,null,null,93893,97744]
[null,null,null,null,null,null,null,null,null,null,null,null,38597,41658,null,47649,53650,60740,null,null,null,70720,75113,null,null,null,null,null,null,null,null,93894,97744]
[null,null,null,null,null,null,null,null,null,null,null,null,38600,41660,null,47650,53653,60742,null,null,null,70723,75114,null,null,null,null,null,null,null,null,93896,97744]
[null,null,null,null,null,null,null,null,null,null,null,null,38610,41663,null,47655,53654,60743,null,null,null,70725,75116,null,null,null,null,null,null,null,null,93897,97744]
[null,null,null,null,null,null,null,null,null,null,null,null,38612,41664,null,47656,53655,60744,null,null,null,70726,75117,null,null,null,null,null,null,null,null,93898,97745]
[null,null,null,null,null,null,null,null,null,null,null,null,38613,41665,null,47657,53658,60745,null,null,null,70728,75118,null,null,null,null,null,null,null,null,93900,97746]
[null,null,null,null,null,null,null,null,null,null,null,null,38614,41666,null,47660,53659,60746,null,null,null,70730,75119,null,null,null,null,null,null,null,null,93904,97747]
[null,null,null,null,null,null,null,null,null,null,null,null,38620,41667,null,47664,53660,60750,null,null,null,70735,75120,null,null,null,null,null,null,null,null,93905,97748]
[null,null,null,null,null,null,null,null,null,null,null,null,38623,41668,null,47670,53664,60753,null,null,null,70736,75125,null,null,null,null,null,null,null,null,93907,97750]
[null,null,null,null,null,null,null,null,null,null,null,null,38624,41669,null,47674,53670,60754,null,null,null,70737,75126,null,null,null,null,null,null,null,null,93908,97751]
[null,null,null,null,null,null,null,null,null,null,null,null,38625,41670,null,47675,53680,60756,null,null,null,70738,75127,null,null,null,null,null,null,null,null,93910,97753]
[null,null,null,null,null,null,null,null,null,null,null,null,38630,41671,null,47676,53687,60757,null,null,null,70740,75128,null,null,null,null,null,null,null,null,93915,97754]
[null,null,null,null,null,null,null,null,null,null,null,null,38640,41676,null,47680,53688,60760,null,null,null,70742,75129,null,null,null,null,null,null,null,null,93918,97755]
[null,null,null,null,null,null,null,null,null,null,null,null,38642,41677,null,47684,53689,60763,null,null,null,70744,75130,null,null,null,null,null,null,null,null,93930,97755]
[null,null,null,null,null,null,null,null,null,null,null,null,38650,41678,null,47685,53690,60765,null,null,null,70745,75133,null,null,null,null,null,null,null,null,93936,97755]
[null,null,null,null,null,null,null,null,null,null,null,null,38652,41679,null,47690,53694,60766,null,null,null,70746,75134,null,null,null,null,null,null,null,null,93940,97756]
[null,null,null,null,null,null,null,null,null,null,null,null,38653,41680,null,47694,53695,60770,null,null,null,70750,75135,null,null,null,null,null,null,null,null,93950,97756]
[null,null,null,null,null,null,null,null,null,null,null,null,38654,41681,null,47698,53696,60773,null,null,null,70755,75136,null,null,null,null,null,null,null,null,93954,97757]
[null,null,null,null,null,null,null,null,null,null,null,null,38660,41682,null,47700,53697,60775,null,null,null,70756,75137,null,null,null,null,null,null,null,null,93956,97758]
[null,null,null,null,null,null,null,null,null,null,null,null,38664,41688,null,47703,53698,60776,null,null,null,70760,75138,null,null,null,null,null,null,null,null,93957,97758]
[null,null,null,null,null,null,null,null,null,null,null,null,38670,41690,null,47707,53700,60778,null,null,null,70762,75140,null,null,null,null,null,null,null,null,93960,97758]
[null,null,null,null,null,null,null,null,null,null,null,null,38672,41695,null,47710,53708,60780,null,null,null,70763,75142,null,null,null,null,null,null,null,null,93963,97758]
[null,null,null,null,null,null,null,null,null,null,null,null,38673,41700,null,47714,53710,60782,null,null,null,70764,75143,null,null,null,null,null,null,null,null,93965,97758]
[null,null,null,null,null,null,null,null,null,null,null,null,38674,41701,null,47715,53713,60783,null,null,null,70765,75145,null,null,null,null,null,null,null,null,93967,97758]
[null,null,null,null,null,null,null,null,null,null,null,null,38675,41702,null,47716,53714,60784,null,null,null,70766,75147,null,null,null,null,null,null,null,null,93970,97758]
[null,null,null,null,null,null,null,null,null,null,null,null,38676,41703,null,47720,53716,60785,null,null,null,70767,75148,null,null,null,null,null,null,null,null,93980,97758]
[null,null,null,null,null,null,null,null,null,null,null,null,38679,41704,null,47723,53717,60786,null,null,null,70769,75150,null,null,null,null,null,null,null,null,93986,97758]
[null,null,null,null,null,null,null,null,null,null,null,null,38680,41705,null,47724,53718,60790,null,null,null,70770,75151,null,null,null,null,null,null,null,null,93990,97758]
[null,null,null,null,null,null,null,null,null,null,null,null,38683,41710,null,47725,53719,60793,null,null,null,70771,75153,null,null,null,null,null,null,null,null,93994,97758]
[null,null,null,null,null,null,null,null,null,null,null,null,38689,41711,null,47726,53730,60794,null,null,null,70772,75154,null,null,null,null,null,null,null,null,93995,97758]
[null,null,null,null,null,null,null,null,null,null,null,null,38700,41713,null,47727,53760,60795,null,null,null,70773,75155,null,null,null,null,null,null,null,null,93996,97758]
[null,null,null,null,null,null,null,null,null,null,null,null,38701,41720,null,47728,53770,60800,null,null,null,70774,75157,null,null,null,null,null,null,null,null,93997,97758]
[null,null,null,null,null,null,null,null,null,null,null,null,38702,41721,null,47729,53780,60803,null,null,null,70775,75158,null,null,null,null,null,null,null,null,93998,97758]
[null,null,null,null,null,null,null,null,null,null,null,null,38703,41723,null,47730,53787,60804,null,null,null,70776,75159,null,null,null,null,null,null,null,null,94000,97759]
[null,null,null,null,null,null,null,null,null,null,null,null,38704,41725,null,47732,53788,60805,null,null,null,70777,75160,null,null,null,null,null,null,null,null,94019,97759]
[null,null,null,null,null,null,null,null,null,null,null,null,38705,41726,null,47733,53790,60806,null,null,null,70778,75162,null,null,null,null,null,null,null,null,94020,97760]
[null,null,null,null,null,null,null,null,null,null,null,null,38706,41729,null,47734,53798,60807,null,null,null,70780,75163,null,null,null,null,null,null,null,null,94021,97760]
[null,null,null,null,null,null,null,null,null,null,null,null,38708,41730,null,47736,53799,60810,null,null,null,70783,75164,null,null,null,null,null,null,null,null,94023,97760]
[null,null,null,null,null,null,null,null,null,null,null,null,38709,41731,null,47740,53800,60814,null,null,null,70784,75165,null,null,null,null,null,null,null,null,94024,97760]
[null,null,null,null,null,null,null,null,null,null,null,null,38710,41733,null,47741,53809,60815,null,null,null,70785,75166,null,null,null,null,null,null,null,null,94027,97760]
[null,null,null,null,null,null,null,null,null,null,null,null,38712,41734,null,47742,53810,60820,null,null,null,70786,75167,null,null,null,null,null,null,null,null,94030,97760]
[null,null,null,null,null,null,null,null,null,null,null,null,38713,41735,null,47743,53819,60821,null,null,null,70787,75169,null,null,null,null,null,null,null,null,94034,97760]
[null,null,null,null,null,null,null,null,null,null,null,null,38714,41736,null,47744,53820,60822,null,null,null,70789,75170,null,null,null,null,null,null,null,null,94035,97761]
[null,null,null,null,null,null,null,null,null,null,null,null,38715,41740,null,47746,53830,60823,null,null,null,70790,75171,null,null,null,null,null,null,null,null,94050,97762]
[null,null,null,null,null,null,null,null,null,null,null,null,38716,41741,null,47747,53839,60824,null,null,null,70795,75173,null,null,null,null,null,null,null,null,94054,97763]
[null,null,null,null,null,null,null,null,null,null,null,null,38717,41742,null,47748,53840,60825,null,null,null,70800,75175,null,null,null,null,null,null,null,null,94057,97763]
[null,null,null,null,null,null,null,null,null,null,null,null,38720,41743,null,47750,53900,60826,null,null,null,70802,75176,null,null,null,null,null,null,null,null,94059,97763]
[null,null,null,null,null,null,null,null,null,null,null,null,38724,41750,null,47755,53909,60827,null,null,null,70803,75178,null,null,null,null,null,null,null,null,94060,97763]
[null,null,null,null,null,null,null,null,null,null,null,null,38725,41753,null,47760,53910,60828,null,null,null,70805,75179,null,null,null,null,null,null,null,null,94063,97763]
[null,null,null,null,null,null,null,null,null,null,null,null,38727,41754,null,47764,53930,60840,null,null,null,70806,75180,null,null,null,null,null,null,null,null,94064,97763]
[null,null,null,null,null,null,null,null,null,null,null,null,38730,41755,null,47765,53940,60843,null,null,null,70808,75186,null,null,null,null,null,null,null,null,94080,97763]
[null,null,null,null,null,null,null,null,null,null,null,null,38733,41760,null,47766,53950,60844,null,null,null,70809,75187,null,null,null,null,null,null,null,null,94084,97764]
[null,null,null,null,null,null,null,null,null,null,null,null,38734,41761,null,47767,53960,60845,null,null,null,70810,75190,null,null,null,null,null,null,null,null,94086,97764]
[null,null,null,null,null,null,null,null,null,null,null,null,38735,41762,null,47768,53970,60846,null,null,null,70811,75194,null,null,null,null,null,null,null,null,94100,97765]
[null,null,null,null,null,null,null,null,null,null,null,null,38736,41763,null,47769,54000,60847,null,null,null,70813,75196,null,null,null,null,null,null,null,null,94103,97766]
[null,null,null,null,null,null,null,null,null,null,null,null,38737,41769,null,47770,54009,60849,null,null,null,70814,75197,null,null,null,null,null,null,null,null,94106,97766]
[null,null,null,null,null,null,null,null,null,null,null,null,38740,41770,null,47775,54010,60850,null,null,null,70816,75200,null,null,null,null,null,null,null,null,94107,97766]
[null,null,null,null,null,null,null,null,null,null,null,null,38743,41771,null,47777,54015,60853,null,null,null,70818,75203,null,null,null,null,null,null,null,null,94108,97767]
[null,null,null,null,null,null,null,null,null,null,null,null,38745,41772,null,47778,54016,60854,null,null,null,70820,75204,null,null,null,null,null,null,null,null,94110,97768]
[null,null,null,null,null,null,null,null,null,null,null,null,38747,41774,null,47779,54017,60855,null,null,null,70823,75205,null,null,null,null,null,null,null,null,94113,97768]
[null,null,null,null,null,null,null,null,null,null,null,null,38750,41775,null,47780,54020,60856,null,null,null,70826,75206,null,null,null,null,null,null,null,null,94116,97768]
[null,null,null,null,null,null,null,null,null,null,null,null,38753,41776,null,47785,54021,60857,null,null,null,70827,75207,null,null,null,null,null,null,null,null,94117,97769]
[null,null,null,null,null,null,null,null,null,null,null,null,38754,41777,null,47786,54022,60863,null,null,null,70828,75210,null,null,null,null,null,null,null,null,94118,97769]
[null,null,null,null,null,null,null,null,null,null,null,null,38755,41778,null,47795,54023,60864,null,null,null,70829,75211,null,null,null,null,null,null,null,null,94120,97769]
[null,null,null,null,null,null,null,null,null,null,null,null,38756,41780,null,47797,54025,60865,null,null,null,70830,75212,null,null,null,null,null,null,null,null,94123,97769]
[null,null,null,null,null,null,null,null,null,null,null,null,38757,41781,null,47798,54026,60866,null,null,null,70833,75214,null,null,null,null,null,null,null,null,94124,97769]
[null,null,null,null,null,null,null,null,null,null,null,null,38760,41782,null,47799,54028,60867,null,null,null,70834,75215,null,null,null,null,null,null,null,null,94125,97770]
[null,null,null,null,null,null,null,null,null,null,null,null,38763,41783,null,47800,54030,60870,null,null,null,70835,75219,null,null,null,null,null,null,null,null,94126,97770]
[null,null,null,null,null,null,null,null,null,null,null,null,38764,41790,null,47810,54033,60873,null,null,null,70836,75220,null,null,null,null,null,null,null,null,94127,97773]
[null,null,null,null,null,null,null,null,null,null,null,null,38765,41800,null,47820,54037,60874,null,null,null,70837,75221,null,null,null,null,null,null,null,null,94130,97773]
[null,null,null,null,null,null,null,null,null,null,null,null,38766,41811,null,47829,54038,60875,null,null,null,70838,75223,null,null,null,null,null,null,null,null,94133,97773]
[null,null,null,null,null,null,null,null,null,null,null,null,38767,41820,null,47830,54040,60876,null,null,null,70839,75225,null,null,null,null,null,null,null,null,94134,97773]
[null,null,null,null,null,null,null,null,null,null,null,null,38770,41821,null,47840,54049,60877,null,null,null,70840,75226,null,null,null,null,null,null,null,null,94135,97773]
[null,null,null,null,null,null,null,null,null,null,null,null,38773,41828,null,47849,54050,60878,null,null,null,70842,75230,null,null,null,null,null,null,null,null,94136,97773]
[null,null,null,null,null,null,null,null,null,null,null,null,38776,41829,null,47850,54054,60880,null,null,null,70843,75232,null,null,null,null,null,null,null,null,94138,97773]
[null,null,null,null,null,null,null,null,null,null,null,null,38777,41830,null,47860,54055,60883,null,null,null,70844,75233,null,null,null,null,null,null,null,null,94140,97774]
[null,null,null,null,null,null,null,null,null,null,null,null,38780,41840,null,47862,54057,60884,null,null,null,70845,75234,null,null,null,null,null,null,null,null,94142,97774]
[null,null,null,null,null,null,null,null,null,null,null,null,38783,41841,null,47870,54059,60885,null,null,null,70850,75235,null,null,null,null,null,null,null,null,94143,97774]
[null,null,null,null,null,null,null,null,null,null,null,null,38784,41842,null,47880,54060,60886,null,null,null,70851,75237,null,null,null,null,null,null,null,null,94144,97774]
[null,null,null,null,null,null,null,null,null,null,null,null,38785,41843,null,47882,54063,60887,null,null,null,70852,75238,null,null,null,null,null,null,null,null,94145,97774]
[null,null,null,null,null,null,null,null,null,null,null,null,38786,41844,null,47890,54067,60888,null,null,null,70854,75240,null,null,null,null,null,null,null,null,94147,97774]
[null,null,null,null,null,null,null,null,null,null,null,null,38787,41846,null,47892,54068,60890,null,null,null,70855,75245,null,null,null,null,null,null,null,null,94149,97774]
[null,null,null,null,null,null,null,null,null,null,null,null,38790,41850,null,47898,54069,60893,null,null,null,70860,75250,null,null,null,null,null,null,null,null,94150,97774]
[null,null,null,null,null,null,null,null,null,null,null,null,38793,41851,null,47899,54070,60894,null,null,null,70861,75254,null,null,null,null,null,null,null,null,94153,97774]
[null,null,null,null,null,null,null,null,null,null,null,null,38794,41852,null,47900,54073,60895,null,null,null,70862,75256,null,null,null,null,null,null,null,null,94154,97774]
[null,null,null,null,null,null,null,null,null,null,null,null,38795,41860,null,47902,54075,60896,null,null,null,70864,75257,null,null,null,null,null,null,null,null,94155,97775]
[null,null,null,null,null,null,null,null,null,null,null,null,38796,41870,null,47903,54076,60897,null,null,null,70866,75258,null,null,null,null,null,null,null,null,94157,97775]
[null,null,null,null,null,null,null,null,null,null,null,null,38797,41872,null,47904,54080,60898,null,null,null,70868,75259,null,null,null,null,null,null,null,null,94158,97775]
[null,null,null,null,null,null,null,null,null,null,null,null,38798,41873,null,47905,54090,60900,null,null,null,70869,75260,null,null,null,null,null,null,null,null,94160,97776]
[null,null,null,null,null,null,null,null,null,null,null,null,38800,41874,null,47909,54092,60903,null,null,null,70870,75270,null,null,null,null,null,null,null,null,94164,97776]
[null,null,null,null,null,null,null,null,null,null,null,null,38810,41875,null,47910,54093,60904,null,null,null,70872,75280,null,null,null,null,null,null,null,null,94167,97776]
[null,null,null,null,null,null,null,null,null,null,null,null,38817,41879,null,47912,54094,60905,null,null,null,70873,75290,null,null,null,null,null,null,null,null,94170,97777]
[null,null,null,null,null,null,null,null,null,null,null,null,38820,41880,null,47913,54098,60906,null,null,null,70874,75300,null,null,null,null,null,null,null,null,94178,97777]
[null,null,null,null,null,null,null,null,null,null,null,null,38823,41887,null,47914,54100,60907,null,null,null,70875,75301,null,null,null,null,null,null,null,null,94179,97777]
[null,null,null,null,null,null,null,null,null,null,null,null,38825,41890,null,47915,54108,60908,null,null,null,70877,75305,null,null,null,null,null,null,null,null,94180,97777]
[null,null,null,null,null,null,null,null,null,null,null,null,38826,41892,null,47916,54109,60910,null,null,null,70878,75306,null,null,null,null,null,null,null,null,94183,97780]
[null,null,null,null,null,null,null,null,null,null,null,null,38827,41900,null,47917,54110,60913,null,null,null,70880,75307,null,null,null,null,null,null,null,null,94184,97782]
[null,null,null,null,null,null,null,null,null,null,null,null,38830,41905,null,47918,54118,60914,null,null,null,70882,75310,null,null,null,null,null,null,null,null,94186,97782]
[null,null,null,null,null,null,null,null,null,null,null,null,38833,41906,null,47920,54119,60915,null,null,null,70884,75311,null,null,null,null,null,null,null,null,94188,97782]
[null,null,null,null,null,null,null,null,null,null,null,null,38834,41907,null,47924,54120,60916,null,null,null,70887,75320,null,null,null,null,null,null,null,null,94190,97782]
[null,null,null,null,null,null,null,null,null,null,null,null,38835,41910,null,47925,54124,60917,null,null,null,70888,75322,null,null,null,null,null,null,null,null,94191,97782]
[null,null,null,null,null,null,null,null,null,null,null,null,38836,41913,null,47926,54126,60918,null,null,null,70889,75324,null,null,null,null,null,null,null,null,94193,97782]
[null,null,null,null,null,null,null,null,null,null,null,null,38837,41914,null,47927,54127,60920,null,null,null,70890,75325,null,null,null,null,null,null,null,null,94194,97782]
[null,null,null,null,null,null,null,null,null,null,null,null,38838,41915,null,47930,54128,60921,null,null,null,70893,75328,null,null,null,null,null,null,null,null,94195,97782]
[null,null,null,null,null,null,null,null,null,null,null,null,38840,41916,null,47934,54130,60923,null,null,null,70894,75330,null,null,null,null,null,null,null,null,94200,97782]
[null,null,null,null,null,null,null,null,null,null,null,null,38844,41917,null,47935,54134,60924,null,null,null,70897,75332,null,null,null,null,null,null,null,null,94210,97782]
[null,null,null,null,null,null,null,null,null,null,null,null,38845,41920,null,47936,54135,60925,null,null,null,70899,75333,null,null,null,null,null,null,null,null,94212,97782]
[null,null,null,null,null,null,null,null,null,null,null,null,38848,41922,null,47937,54136,60926,null,null,null,70900,75335,null,null,null,null,null,null,null,null,94213,97782]
[null,null,null,null,null,null,null,null,null,null,null,null,38850,41924,null,47938,54140,60927,null,null,null,70902,75336,null,null,null,null,null,null,null,null,94216,97782]
[null,null,null,null,null,null,null,null,null,null,null,null,38853,41926,null,47939,54142,60929,null,null,null,70904,75338,null,null,null,null,null,null,null,null,94220,97782]
[null,null,null,null,null,null,null,null,null,null,null,null,38854,41927,null,47940,54143,60930,null,null,null,70905,75340,null,null,null,null,null,null,null,null,94222,97782]
[null,null,null,null,null,null,null,null,null,null,null,null,38855,41928,null,47945,54145,60932,null,null,null,70906,75360,null,null,null,null,null,null,null,null,94223,97783]
[null,null,null,null,null,null,null,null,null,null,null,null,38860,41930,null,47946,54146,60933,null,null,null,70907,75380,null,null,null,null,null,null,null,null,94224,97783]
[null,null,null,null,null,null,null,null,null,null,null,null,38863,41933,null,47947,54147,60934,null,null,null,70908,75386,null,null,null,null,null,null,null,null,94225,97783]
[null,null,null,null,null,null,null,null,null,null,null,null,38864,41934,null,47948,54149,60935,null,null,null,70910,75387,null,null,null,null,null,null,null,null,94226,97783]
[null,null,null,null,null,null,null,null,null,null,null,null,38865,41936,null,47949,54150,60936,null,null,null,70920,75389,null,null,null,null,null,null,null,null,94227,97783]
[null,null,null,null,null,null,null,null,null,null,null,null,38866,41937,null,47950,54152,60938,null,null,null,70921,75390,null,null,null,null,null,null,null,null,94229,97783]
[null,null,null,null,null,null,null,null,null,null,null,null,38867,41940,null,47952,54158,60940,null,null,null,70923,75393,null,null,null,null,null,null,null,null,94230,97783]
[null,null,null,null,null,null,null,null,null,null,null,null,38868,41943,null,47955,54160,60943,null,null,null,70924,75394,null,null,null,null,null,null,null,null,94233,97783]
[null,null,null,null,null,null,null,null,null,null,null,null,38870,41944,null,47956,54162,60944,null,null,null,70925,75395,null,null,null,null,null,null,null,null,94234,97783]
[null,null,null,null,null,null,null,null,null,null,null,null,38873,41945,null,47957,54168,60945,null,null,null,70926,75396,null,null,null,null,null,null,null,null,94235,97784]
[null,null,null,null,null,null,null,null,null,null,null,null,38874,41946,null,47958,54170,60946,null,null,null,70927,75398,null,null,null,null,null,null,null,null,94236,97784]
[null,null,null,null,null,null,null,null,null,null,null,null,38880,41947,null,47959,54172,60947,null,null,null,70930,75399,null,null,null,null,null,null,null,null,94240,97784]
[null,null,null,null,null,null,null,null,null,null,null,null,38887,41948,null,47960,54173,60948,null,null,null,70934,75400,null,null,null,null,null,null,null,null,94242,97784]
[null,null,null,null,null,null,null,null,null,null,null,null,38900,41949,null,47964,54180,60950,null,null,null,70935,75404,null,null,null,null,null,null,null,null,94243,97784]
[null,null,null,null,null,null,null,null,null,null,null,null,38903,41950,null,47965,54187,60952,null,null,null,70936,75410,null,null,null,null,null,null,null,null,94244,97784]
[null,null,null,null,null,null,null,null,null,null,null,null,38904,41951,null,47970,54189,60953,null,null,null,70937,75412,null,null,null,null,null,null,null,null,94245,97784]
[null,null,null,null,null,null,null,null,null,null,null,null,38905,41952,null,47974,54190,60954,null,null,null,70938,75415,null,null,null,null,null,null,null,null,94246,97784]
[null,null,null,null,null,null,null,null,null,null,null,null,38909,41953,null,47975,54193,60955,null,null,null,70940,75420,null,null,null,null,null,null,null,null,94247,97784]
[null,null,null,null,null,null,null,null,null,null,null,null,38910,41954,null,47976,54195,60956,null,null,null,70942,75421,null,null,null,null,null,null,null,null,94248,97784]
[null,null,null,null,null,null,null,null,null,null,null,null,38911,41955,null,47977,54196,60960,null,null,null,70943,75424,null,null,null,null,null,null,null,null,94249,97784]
[null,null,null,null,null,null,null,null,null,null,null,null,38912,41960,null,47980,54197,60964,null,null,null,70944,75440,null,null,null,null,null,null,null,null,94250,97785]
[null,null,null,null,null,null,null,null,null,null,null,null,38914,41962,null,47983,54198,60965,null,null,null,70945,75443,null,null,null,null,null,null,null,null,94253,97785]
[null,null,null,null,null,null,null,null,null,null,null,null,38915,41963,null,47984,54200,60967,null,null,null,70946,75444,null,null,null,null,null,null,null,null,94254,97785]
[null,null,null,null,null,null,null,null,null,null,null,null,38919,41965,null,47986,54203,60968,null,null,null,70947,75445,null,null,null,null,null,null,null,null,94255,97785]
[null,null,null,null,null,null,null,null,null,null,null,null,38920,41968,null,47987,54204,60970,null,null,null,70949,75460,null,null,null,null,null,null,null,null,94256,97786]
[null,null,null,null,null,null,null,null,null,null,null,null,38921,41970,null,47988,54220,60973,null,null,null,70950,75464,null,null,null,null,null,null,null,null,94260,97786]
[null,null,null,null,null,null,null,null,null,null,null,null,38927,41980,null,47989,54223,60974,null,null,null,70952,75465,null,null,null,null,null,null,null,null,94263,97787]
[null,null,null,null,null,null,null,null,null,null,null,null,38930,41985,null,47990,54224,60975,null,null,null,70953,75466,null,null,null,null,null,null,null,null,94264,97787]
[null,null,null,null,null,null,null,null,null,null,null,null,38931,41987,null,47993,54225,60976,null,null,null,70954,75467,null,null,null,null,null,null,null,null,94265,97787]
[null,null,null,null,null,null,null,null,null,null,null,null,38932,41993,null,47994,54226,60977,null,null,null,70955,75468,null,null,null,null,null,null,null,null,94266,97787]
[null,null,null,null,null,null,null,null,null,null,null,null,38933,41994,null,47995,54227,60980,null,null,null,70956,75469,null,null,null,null,null,null,null,null,94267,97787]
[null,null,null,null,null,null,null,null,null,null,null,null,38940,41995,null,47996,54233,60982,null,null,null,70960,75470,null,null,null,null,null,null,null,null,94270,97790]
[null,null,null,null,null,null,null,null,null,null,null,null,38943,41996,null,47997,54234,60983,null,null,null,70963,75471,null,null,null,null,null,null,null,null,94271,97790]
[null,null,null,null,null,null,null,null,null,null,null,null,38944,41997,null,47998,54235,60985,null,null,null,70964,75472,null,null,null,null,null,null,null,null,94273,97790]
[null,null,null,null,null,null,null,null,null,null,null,null,38945,41998,null,48000,54236,60987,null,null,null,70965,75476,null,null,null,null,null,null,null,null,94274,97793]
[null,null,null,null,null,null,null,null,null,null,null,null,38946,null,null,48010,54237,60988,null,null,null,70966,75480,null,null,null,null,null,null,null,null,94275,97793]
[null,null,null,null,null,null,null,null,null,null,null,null,38947,null,null,48017,54239,60990,null,null,null,70967,75483,null,null,null,null,null,null,null,null,94276,97793]
[null,null,null,null,null,null,null,null,null,null,null,null,38950,null,null,48020,54240,60992,null,null,null,70970,75484,null,null,null,null,null,null,null,null,94277,97793]
[null,null,null,null,null,null,null,null,null,null,null,null,38953,null,null,48026,54246,60993,null,null,null,70972,75485,null,null,null,null,null,null,null,null,94278,97793]
[null,null,null,null,null,null,null,null,null,null,null,null,38954,null,null,48030,54250,60994,null,null,null,70973,75486,null,null,null,null,null,null,null,null,94280,97793]
[null,null,null,null,null,null,null,null,null,null,null,null,38955,null,null,48035,54253,60995,null,null,null,70974,75487,null,null,null,null,null,null,null,null,94285,97793]
[null,null,null,null,null,null,null,null,null,null,null,null,38956,null,null,48040,54254,60996,null,null,null,70980,75490,null,null,null,null,null,null,null,null,94286,97794]
[null,null,null,null,null,null,null,null,null,null,null,null,38957,null,null,48047,54255,60997,null,null,null,70982,75491,null,null,null,null,null,null,null,null,94287,97794]
[null,null,null,null,null,null,null,null,null,null,null,null,38958,null,null,48048,54256,60998,null,null,null,70984,75492,null,null,null,null,null,null,null,null,94290,97794]
[null,null,null,null,null,null,null,null,null,null,null,null,38960,null,null,48050,54257,61000,null,null,null,70985,75494,null,null,null,null,null,null,null,null,94293,97795]
[null,null,null,null,null,null,null,null,null,null,null,null,38961,null,null,48060,54260,61002,null,null,null,70987,75495,null,null,null,null,null,null,null,null,94294,97795]
[null,null,null,null,null,null,null,null,null,null,null,null,38963,null,null,48064,54263,61003,null,null,null,70988,75497,null,null,null,null,null,null,null,null,94295,97795]
[null,null,null,null,null,null,null,null,null,null,null,null,38964,null,null,48065,54264,61004,null,null,null,70989,75498,null,null,null,null,null,null,null,null,94296,97795]
[null,null,null,null,null,null,null,null,null,null,null,null,38965,null,null,48068,54265,61005,null,null,null,70990,75499,null,null,null,null,null,null,null,null,94297,97795]
[null,null,null,null,null,null,null,null,null,null,null,null,38966,null,null,48070,54270,61006,null,null,null,70991,75500,null,null,null,null,null,null,null,null,94298,97796]
[null,null,null,null,null,null,null,null,null,null,null,null,38967,null,null,48075,54273,61007,null,null,null,70992,75505,null,null,null,null,null,null,null,null,94299,97798]
[null,null,null,null,null,null,null,null,null,null,null,null,38970,null,null,48076,54274,61008,null,null,null,70993,75507,null,null,null,null,null,null,null,null,94300,97799]
[null,null,null,null,null,null,null,null,null,null,null,null,38973,null,null,48077,54275,61010,null,null,null,70994,75510,null,null,null,null,null,null,null,null,94303,97800]
[null,null,null,null,null,null,null,null,null,null,null,null,38974,null,null,48078,54276,61012,null,null,null,70995,75512,null,null,null,null,null,null,null,null,94310,97800]
[null,null,null,null,null,null,null,null,null,null,null,null,38975,null,null,48080,54280,61014,null,null,null,71000,75513,null,null,null,null,null,null,null,null,94311,97800]
[null,null,null,null,null,null,null,null,null,null,null,null,38977,null,null,48084,54283,61015,null,null,null,71001,75514,null,null,null,null,null,null,null,null,94315,97803]
[null,null,null,null,null,null,null,null,null,null,null,null,38978,null,null,48085,54284,61016,null,null,null,71002,75515,null,null,null,null,null,null,null,null,94320,97803]
[null,null,null,null,null,null,null,null,null,null,null,null,38980,null,null,48086,54285,61017,null,null,null,71003,75517,null,null,null,null,null,null,null,null,94324,97803]
[null,null,null,null,null,null,null,null,null,null,null,null,38982,null,null,48087,54290,61018,null,null,null,71004,75520,null,null,null,null,null,null,null,null,94326,97803]
[null,null,null,null,null,null,null,null,null,null,null,null,38983,null,null,48089,54293,61020,null,null,null,71005,75524,null,null,null,null,null,null,null,null,94327,97804]
[null,null,null,null,null,null,null,null,null,null,null,null,38984,null,null,48090,54294,61023,null,null,null,71006,75525,null,null,null,null,null,null,null,null,94328,97804]
[null,null,null,null,null,null,null,null,null,null,null,null,38985,null,null,48093,54295,61024,null,null,null,71007,75526,null,null,null,null,null,null,null,null,94329,97804]
[null,null,null,null,null,null,null,null,null,null,null,null,38986,null,null,48095,54296,61025,null,null,null,71009,75527,null,null,null,null,null,null,null,null,94330,97804]
[null,null,null,null,null,null,null,null,null,null,null,null,38987,null,null,48096,54297,61026,null,null,null,71010,75528,null,null,null,null,null,null,null,null,94333,97804]
[null,null,null,null,null,null,null,null,null,null,null,null,38988,null,null,48098,54300,61030,null,null,null,71011,75529,null,null,null,null,null,null,null,null,94334,97804]
[null,null,null,null,null,null,null,null,null,null,null,null,38989,null,null,48100,54310,61034,null,null,null,71012,75530,null,null,null,null,null,null,null,null,94335,97804]
[null,null,null,null,null,null,null,null,null,null,null,null,38990,null,null,48110,54313,61035,null,null,null,71013,75535,null,null,null,null,null,null,null,null,94337,97804]
[null,null,null,null,null,null,null,null,null,null,null,null,38993,null,null,48120,54314,61036,null,null,null,71014,75536,null,null,null,null,null,null,null,null,94339,97804]
[null,null,null,null,null,null,null,null,null,null,null,null,38994,null,null,48130,54315,61037,null,null,null,71015,75537,null,null,null,null,null,null,null,null,94340,97805]
[null,null,null,null,null,null,null,null,null,null,null,null,38995,null,null,48135,54320,61040,null,null,null,71016,75538,null,null,null,null,null,null,null,null,94344,97805]
[null,null,null,null,null,null,null,null,null,null,null,null,38996,null,null,48136,54324,61041,null,null,null,71017,75539,null,null,null,null,null,null,null,null,94345,97806]
[null,null,null,null,null,null,null,null,null,null,null,null,38997,null,null,48139,54325,61042,null,null,null,71020,75540,null,null,null,null,null,null,null,null,94346,97807]
[null,null,null,null,null,null,null,null,null,null,null,null,null,null,null,48140,54326,61043,null,null,null,71021,75541,null,null,null,null,null,null,null,null,94347,97810]
[null,null,null,null,null,null,null,null,null,null,null,null,null,null,null,48145,54327,61045,null,null,null,71030,75547,null,null,null,null,null,null,null,null,94349,97810]
[null,null,null,null,null,null,null,null,null,null,null,null,null,null,null,48146,54330,61046,null,null,null,71031,75550,null,null,null,null,null,null,null,null,94350,97812]
[null,null,null,null,null,null,null,null,null,null,null,null,null,null,null,48150,54333,61047,null,null,null,71033,75551,null,null,null,null,null,null,null,null,94353,97813]
[null,null,null,null,null,null,null,null,null,null,null,null,null,null,null,48153,54334,61048,null,null,null,71037,75558,null,null,null,null,null,null,null,null,94360,97814]
[null,null,null,null,null,null,null,null,null,null,null,null,null,null,null,48155,54335,61050,null,null,null,71040,75560,null,null,null,null,null,null,null,null,94363,97816]
[null,null,null,null,null,null,null,null,null,null,null,null,null,null,null,48159,54336,61051,null,null,null,71041,75562,null,null,null,null,null,null,null,null,94364,97816]
[null,null,null,null,null,null,null,null,null,null,null,null,null,null,null,48160,54337,61053,null,null,null,71043,75563,null,null,null,null,null,null,null,null,94370,97818]
[null,null,null,null,null,null,null,null,null,null,null,null,null,null,null,48165,54340,61054,null,null,null,71047,75565,null,null,null,null,null,null,null,null,94380,97818]
[null,null,null,null,null,null,null,null,null,null,null,null,null,null,null,48166,54345,61055,null,null,null,71050,75570,null,null,null,null,null,null,null,null,94384,97820]
[null,null,null,null,null,null,null,null,null,null,null,null,null,null,null,48170,54346,61060,null,null,null,71053,75571,null,null,null,null,null,null,null,null,94389,97822]
[null,null,null,null,null,null,null,null,null,null,null,null,null,null,null,48175,54350,61062,null,null,null,71054,75580,null,null,null,null,null,null,null,null,94390,97822]
[null,null,null,null,null,null,null,null,null,null,null,null,null,null,null,48180,54360,61063,null,null,null,71055,75584,null,null,null,null,null,null,null,null,94393,97822]
[null,null,null,null,null,null,null,null,null,null,null,null,null,null,null,48185,54363,61064,null,null,null,71056,75585,null,null,null,null,null,null,null,null,94394,97822]
[null,null,null,null,null,null,null,null,null,null,null,null,null,null,null,48190,54364,61065,null,null,null,71057,75587,null,null,null,null,null,null,null,null,94399,97823]
[null,null,null,null,null,null,null,null,null,null,null,null,null,null,null,48193,54365,61066,null,null,null,71058,75588,null,null,null,null,null,null,null,null,94400,97823]
[null,null,null,null,null,null,null,null,null,null,null,null,null,null,null,48199,54366,61067,null,null,null,71060,75589,null,null,null,null,null,null,null,null,94410,97823]
[null,null,null,null,null,null,null,null,null,null,null,null,null,null,null,48200,54367,61070,null,null,null,71063,75590,null,null,null,null,null,null,null,null,94420,97824]
[null,null,null,null,null,null,null,null,null,null,null,null,null,null,null,48202,54373,61072,null,null,null,71064,75591,null,null,null,null,null,null,null,null,94422,97824]
[null,null,null,null,null,null,null,null,null,null,null,null,null,null,null,48203,54374,61073,null,null,null,71065,75592,null,null,null,null,null,null,null,null,94423,97824]
[null,null,null,null,null,null,null,null,null,null,null,null,null,null,null,48205,54375,61074,null,null,null,71066,75593,null,null,null,null,null,null,null,null,94424,97824]
[null,null,null,null,null,null,null,null,null,null,null,null,null,null,null,48207,54380,61075,null,null,null,71067,75597,null,null,null,null,null,null,null,null,94427,97825]
[null,null,null,null,null,null,null,null,null,null,null,null,null,null,null,48210,54383,61080,null,null,null,71068,75600,null,null,null,null,null,null,null,null,94428,97825]
[null,null,null,null,null,null,null,null,null,null,null,null,null,null,null,48211,54384,61082,null,null,null,71070,75610,null,null,null,null,null,null,null,null,94430,97825]
[null,null,null,null,null,null,null,null,null,null,null,null,null,null,null,48212,54385,61083,null,null,null,71076,75613,null,null,null,null,null,null,null,null,94440,97826]
[null,null,null,null,null,null,null,null,null,null,null,null,null,null,null,48213,54386,61084,null,null,null,71080,75614,null,null,null,null,null,null,null,null,94442,97826]
[null,null,null,null,null,null,null,null,null,null,null,null,null,null,null,48220,54387,61086,null,null,null,71081,75615,null,null,null,null,null,null,null,null,94445,97826]
[null,null,null,null,null,null,null,null,null,null,null,null,null,null,null,48240,54400,61100,null,null,null,71083,75616,null,null,null,null,null,null,null,null,94446,97827]
[null,null,null,null,null,null,null,null,null,null,null,null,null,null,null,48245,54402,61105,null,null,null,71087,75617,null,null,null,null,null,null,null,null,94447,97830]
[null,null,null,null,null,null,null,null,null,null,null,null,null,null,null,48247,54405,61110,null,null,null,71091,75618,null,null,null,null,null,null,null,null,94450,97830]
[null,null,null,null,null,null,null,null,null,null,null,null,null,null,null,48250,54407,61112,null,null,null,71092,75619,null,null,null,null,null,null,null,null,94452,97835]
[null,null,null,null,null,null,null,null,null,null,null,null,null,null,null,48255,54408,61113,null,null,null,71094,75620,null,null,null,null,null,null,null,null,94453,97835]
[null,null,null,null,null,null,null,null,null,null,null,null,null,null,null,48256,54409,61114,null,null,null,71096,75623,null,null,null,null,null,null,null,null,94454,97835]
[null,null,null,null,null,null,null,null,null,null,null,null,null,null,null,48259,54410,61115,null,null,null,71100,75630,null,null,null,null,null,null,null,null,94455,97835]
[null,null,null,null,null,null,null,null,null,null,null,null,null,null,null,48260,54413,61116,null,null,null,71103,75635,null,null,null,null,null,null,null,null,94456,97835]
[null,null,null,null,null,null,null,null,null,null,null,null,null,null,null,48262,54414,61120,null,null,null,71104,75640,null,null,null,null,null,null,null,null,94457,97836]
[null,null,null,null,null,null,null,null,null,null,null,null,null,null,null,48264,54416,61125,null,null,null,71105,75641,null,null,null,null,null,null,null,null,94458,97836]
[null,null,null,null,null,null,null,null,null,null,null,null,null,null,null,48265,54417,61128,null,null,null,71106,75650,null,null,null,null,null,null,null,null,94460,97836]
[null,null,null,null,null,null,null,null,null,null,null,null,null,null,null,48266,54420,61129,null,null,null,71107,75653,null,null,null,null,null,null,null,null,94462,97837]
[null,null,null,null,null,null,null,null,null,null,null,null,null,null,null,48267,54424,61130,null,null,null,71110,75655,null,null,null,null,null,null,null,null,94463,97837]
[null,null,null,null,null,null,null,null,null,null,null,null,null,null,null,48276,54425,61133,null,null,null,71113,75657,null,null,null,null,null,null,null,null,94464,97840]
[null,null,null,null,null,null,null,null,null,null,null,null,null,null,null,48280,54426,61134,null,null,null,71114,75659,null,null,null,null,null,null,null,null,94465,97840]
[null,null,null,null,null,null,null,null,null,null,null,null,null,null,null,48283,54430,61135,null,null,null,71115,75660,null,null,null,null,null,null,null,null,94466,97840]
[null,null,null,null,null,null,null,null,null,null,null,null,null,null,null,48284,54434,61136,null,null,null,71116,75664,null,null,null,null,null,null,null,null,94467,97840]
[null,null,null,null,null,null,null,null,null,null,null,null,null,null,null,48290,54435,61137,null,null,null,71117,75666,null,null,null,null,null,null,null,null,94470,97840]
[null,null,null,null,null,null,null,null,null,null,null,null,null,null,null,48291,54439,61139,null,null,null,71120,75667,null,null,null,null,null,null,null,null,94472,97840]
[null,null,null,null,null,null,null,null,null,null,null,null,null,null,null,48292,54440,61140,null,null,null,71122,75670,null,null,null,null,null,null,null,null,94473,97840]
[null,null,null,null,null,null,null,null,null,null,null,null,null,null,null,48294,54448,61143,null,null,null,71123,75673,null,null,null,null,null,null,null,null,94474,97843]
[null,null,null,null,null,null,null,null,null,null,null,null,null,null,null,48295,54449,61149,null,null,null,71124,75675,null,null,null,null,null,null,null,null,94475,97843]
[null,null,null,null,null,null,null,null,null,null,null,null,null,null,null,48296,54455,61150,null,null,null,71125,75676,null,null,null,null,null,null,null,null,94476,97844]
[null,null,null,null,null,null,null,null,null,null,null,null,null,null,null,48298,54457,61153,null,null,null,71130,75678,null,null,null,null,null,null,null,null,94477,97844]
[null,null,null,null,null,null,null,null,null,null,null,null,null,null,null,48300,54459,61154,null,null,null,71132,75679,null,null,null,null,null,null,null,null,94478,97845]
[null,null,null,null,null,null,null,null,null,null,null,null,null,null,null,48304,54460,61155,null,null,null,71133,75680,null,null,null,null,null,null,null,null,94479,97847]
[null,null,null,null,null,null,null,null,null,null,null,null,null,null,null,48310,54463,61156,null,null,null,71134,75681,null,null,null,null,null,null,null,null,94486,97848]
[null,null,null,null,null,null,null,null,null,null,null,null,null,null,null,48312,54464,61160,null,null,null,71136,75685,null,null,null,null,null,null,null,null,94487,97850]
[null,null,null,null,null,null,null,null,null,null,null,null,null,null,null,48313,54466,61164,null,null,null,71137,75686,null,null,null,null,null,null,null,null,94488,97851]
[null,null,null,null,null,null,null,null,null,null,null,null,null,null,null,48314,54467,61165,null,null,null,71138,75687,null,null,null,null,null,null,null,null,94489,97854]
[null,null,null,null,null,null,null,null,null,null,null,null,null,null,null,48315,54469,61166,null,null,null,71140,75689,null,null,null,null,null,null,null,null,94490,97857]
[null,null,null,null,null,null,null,null,null,null,null,null,null,null,null,48317,54470,61167,null,null,null,71143,75690,null,null,null,null,null,null,null,null,94493,97858]
[null,null,null,null,null,null,null,null,null,null,null,null,null,null,null,48318,54473,61168,null,null,null,71144,75694,null,null,null,null,null,null,null,null,94494,97858]
[null,null,null,null,null,null,null,null,null,null,null,null,null,null,null,48320,54474,61169,null,null,null,71145,75695,null,null,null,null,null,null,null,null,94495,97858]
[null,null,null,null,null,null,null,null,null,null,null,null,null,null,null,48325,54475,61170,null,null,null,71146,75698,null,null,null,null,null,null,null,null,94496,97860]
[null,null,null,null,null,null,null,null,null,null,null,null,null,null,null,48327,54476,61173,null,null,null,71147,75699,null,null,null,null,null,null,null,null,94497,97862]
[null,null,null,null,null,null,null,null,null,null,null,null,null,null,null,48328,54477,61174,null,null,null,71150,75700,null,null,null,null,null,null,null,null,94500,97862]
[null,null,null,null,null,null,null,null,null,null,null,null,null,null,null,48330,54480,61177,null,null,null,71152,75710,null,null,null,null,null,null,null,null,94510,97862]
[null,null,null,null,null,null,null,null,null,null,null,null,null,null,null,48333,54483,61180,null,null,null,71153,75717,null,null,null,null,null,null,null,null,94513,97862]
[null,null,null,null,null,null,null,null,null,null,null,null,null,null,null,48334,54484,61182,null,null,null,71154,75718,null,null,null,null,null,null,null,null,94515,97862]
[null,null,null,null,null,null,null,null,null,null,null,null,null,null,null,48335,54485,61183,null,null,null,71155,75719,null,null,null,null,null,null,null,null,94516,97862]
[null,null,null,null,null,null,null,null,null,null,null,null,null,null,null,48338,54486,61190,null,null,null,71156,75720,null,null,null,null,null,null,null,null,94517,97863]
[null,null,null,null,null,null,null,null,null,null,null,null,null,null,null,48339,54490,61192,null,null,null,71157,75725,null,null,null,null,null,null,null,null,94520,97864]
[null,null,null,null,null,null,null,null,null,null,null,null,null,null,null,48340,54493,61194,null,null,null,71160,75726,null,null,null,null,null,null,null,null,94530,97864]
[null,null,null,null,null,null,null,null,null,null,null,null,null,null,null,48343,54494,61195,null,null,null,71161,75730,null,null,null,null,null,null,null,null,94534,97864]
[null,null,null,null,null,null,null,null,null,null,null,null,null,null,null,48344,54495,61196,null,null,null,71162,75731,null,null,null,null,null,null,null,null,94540,97864]
[null,null,null,null,null,null,null,null,null,null,null,null,null,null,null,48350,54539,61201,null,null,null,71163,75732,null,null,null,null,null,null,null,null,94542,97864]
[null,null,null,null,null,null,null,null,null,null,null,null,null,null,null,48353,54570,61203,null,null,null,71166,75740,null,null,null,null,null,null,null,null,94543,97864]
[null,null,null,null,null,null,null,null,null,null,null,null,null,null,null,48360,54571,61204,null,null,null,71170,75741,null,null,null,null,null,null,null,null,94545,97864]
[null,null,null,null,null,null,null,null,null,null,null,null,null,null,null,48370,54573,61205,null,null,null,71173,75742,null,null,null,null,null,null,null,null,94546,97870]
[null,null,null,null,null,null,null,null,null,null,null,null,null,null,null,48373,54574,61206,null,null,null,71174,75743,null,null,null,null,null,null,null,null,94550,97873]
[null,null,null,null,null,null,null,null,null,null,null,null,null,null,null,48380,54575,61207,null,null,null,71175,75750,null,null,null,null,null,null,null,null,94552,97880]
[null,null,null,null,null,null,null,null,null,null,null,null,null,null,null,48389,54600,61210,null,null,null,71176,75758,null,null,null,null,null,null,null,null,94553,97880]
[null,null,null,null,null,null,null,null,null,null,null,null,null,null,null,48399,54602,61211,null,null,null,71180,75760,null,null,null,null,null,null,null,null,94554,97882]
[null,null,null,null,null,null,null,null,null,null,null,null,null,null,null,48400,54603,61213,null,null,null,71181,75763,null,null,null,null,null,null,null,null,94556,97883]
[null,null,null,null,null,null,null,null,null,null,null,null,null,null,null,48410,54604,61214,null,null,null,71182,75764,null,null,null,null,null,null,null,null,94557,97883]
[null,null,null,null,null,null,null,null,null,null,null,null,null,null,null,48413,54605,61215,null,null,null,71183,75765,null,null,null,null,null,null,null,null,94558,97883]
[null,null,null,null,null,null,null,null,null,null,null,null,null,null,null,48414,54607,61216,null,null,null,71184,75766,null,null,null,null,null,null,null,null,94559,97883]
[null,null,null,null,null,null,null,null,null,null,null,null,null,null,null,48415,54608,61217,null,null,null,71185,75768,null,null,null,null,null,null,null,null,94560,97884]
[null,null,null,null,null,null,null,null,null,null,null,null,null,null,null,48416,54610,61220,null,null,null,71186,75769,null,null,null,null,null,null,null,null,94570,97884]
[null,null,null,null,null,null,null,null,null,null,null,null,null,null,null,48417,54614,61222,null,null,null,71187,75770,null,null,null,null,null,null,null,null,94575,97884]
[null,null,null,null,null,null,null,null,null,null,null,null,null,null,null,48419,54615,61223,null,null,null,71190,75780,null,null,null,null,null,null,null,null,94580,97884]
[null,null,null,null,null,null,null,null,null,null,null,null,null,null,null,48420,54616,61224,null,null,null,71193,75784,null,null,null,null,null,null,null,null,94589,97885]
[null,null,null,null,null,null,null,null,null,null,null,null,null,null,null,48422,54640,61225,null,null,null,71194,75786,null,null,null,null,null,null,null,null,94590,97886]
[null,null,null,null,null,null,null,null,null,null,null,null,null,null,null,48423,54645,61226,null,null,null,71195,75790,null,null,null,null,null,null,null,null,94600,97886]
[null,null,null,null,null,null,null,null,null,null,null,null,null,null,null,48424,54650,61227,null,null,null,71196,75793,null,null,null,null,null,null,null,null,94610,97887]
[null,null,null,null,null,null,null,null,null,null,null,null,null,null,null,48425,54655,61228,null,null,null,71200,75794,null,null,null,null,null,null,null,null,94613,97887]
[null,null,null,null,null,null,null,null,null,null,null,null,null,null,null,48426,54656,61230,null,null,null,71202,75795,null,null,null,null,null,null,null,null,94620,97887]
[null,null,null,null,null,null,null,null,null,null,null,null,null,null,null,48427,54658,61231,null,null,null,71203,75796,null,null,null,null,null,null,null,null,94630,97890]
[null,null,null,null,null,null,null,null,null,null,null,null,null,null,null,48428,54660,61233,null,null,null,71204,75797,null,null,null,null,null,null,null,null,94635,97890]
[null,null,null,null,null,null,null,null,null,null,null,null,null,null,null,48430,54665,61235,null,null,null,71205,75799,null,null,null,null,null,null,null,null,94640,97894]
[null,null,null,null,null,null,null,null,null,null,null,null,null,null,null,48432,54666,61236,null,null,null,71207,75800,null,null,null,null,null,null,null,null,94643,97895]
[null,null,null,null,null,null,null,null,null,null,null,null,null,null,null,48433,54667,61237,null,null,null,71210,75805,null,null,null,null,null,null,null,null,94649,97899]
[null,null,null,null,null,null,null,null,null,null,null,null,null,null,null,48445,54668,61240,null,null,null,71213,75807,null,null,null,null,null,null,null,null,94650,97899]
[null,null,null,null,null,null,null,null,null,null,null,null,null,null,null,48447,54680,61241,null,null,null,71214,75809,null,null,null,null,null,null,null,null,94657,97900]
[null,null,null,null,null,null,null,null,null,null,null,null,null,null,null,48448,54683,61242,null,null,null,71215,75810,null,null,null,null,null,null,null,null,94660,97904]
[null,null,null,null,null,null,null,null,null,null,null,null,null,null,null,48450,54684,61243,null,null,null,71217,75813,null,null,null,null,null,null,null,null,94670,97908]
[null,null,null,null,null,null,null,null,null,null,null,null,null,null,null,48451,54685,61244,null,null,null,71218,75814,null,null,null,null,null,null,null,null,94677,97910]
[null,null,null,null,null,null,null,null,null,null,null,null,null,null,null,48453,54687,61245,null,null,null,71220,75820,null,null,null,null,null,null,null,null,94679,97915]
[null,null,null,null,null,null,null,null,null,null,null,null,null,null,null,48455,54690,61246,null,null,null,71222,75822,null,null,null,null,null,null,null,null,94680,97917]
[null,null,null,null,null,null,null,null,null,null,null,null,null,null,null,48456,54693,61247,null,null,null,71223,75824,null,null,null,null,null,null,null,null,94687,97918]
[null,null,null,null,null,null,null,null,null,null,null,null,null,null,null,48457,54694,61248,null,null,null,71224,75825,null,null,null,null,null,null,null,null,94688,97920]
[null,null,null,null,null,null,null,null,null,null,null,null,null,null,null,48458,54696,61250,null,null,null,71226,75827,null,null,null,null,null,null,null,null,94689,97922]
[null,null,null,null,null,null,null,null,null,null,null,null,null,null,null,48460,54697,61252,null,null,null,71227,75830,null,null,null,null,null,null,null,null,94690,97922]
[null,null,null,null,null,null,null,null,null,null,null,null,null,null,null,48461,54700,61253,null,null,null,71228,75835,null,null,null,null,null,null,null,null,94693,97923]
[null,null,null,null,null,null,null,null,null,null,null,null,null,null,null,48462,54710,61254,null,null,null,71230,75837,null,null,null,null,null,null,null,null,94696,97923]
[null,null,null,null,null,null,null,null,null,null,null,null,null,null,null,48464,54712,61255,null,null,null,71231,75840,null,null,null,null,null,null,null,null,94699,97924]
[null,null,null,null,null,null,null,null,null,null,null,null,null,null,null,48465,54713,61256,null,null,null,71232,75841,null,null,null,null,null,null,null,null,94700,97924]
[null,null,null,null,null,null,null,null,null,null,null,null,null,null,null,48466,54714,61258,null,null,null,71233,75843,null,null,null,null,null,null,null,null,94703,97924]
[null,null,null,null,null,null,null,null,null,null,null,null,null,null,null,48470,54715,61259,null,null,null,71235,75844,null,null,null,null,null,null,null,null,94720,97924]
[null,null,null,null,null,null,null,null,null,null,null,null,null,null,null,48473,54716,61260,null,null,null,71240,75845,null,null,null,null,null,null,null,null,94722,97924]
[null,null,null,null,null,null,null,null,null,null,null,null,null,null,null,48475,54719,61261,null,null,null,71242,75847,null,null,null,null,null,null,null,null,94723,97924]
[null,null,null,null,null,null,null,null,null,null,null,null,null,null,null,48479,54720,61262,null,null,null,71243,75848,null,null,null,null,null,null,null,null,94724,97925]
[null,null,null,null,null,null,null,null,null,null,null,null,null,null,null,48480,54725,61263,null,null,null,71244,75849,null,null,null,null,null,null,null,null,94726,97925]
[null,null,null,null,null,null,null,null,null,null,null,null,null,null,null,48481,54729,61264,null,null,null,71245,75853,null,null,null,null,null,null,null,null,94730,97925]
[null,null,null,null,null,null,null,null,null,null,null,null,null,null,null,48485,54730,61266,null,null,null,71246,75855,null,null,null,null,null,null,null,null,94732,97925]
[null,null,null,null,null,null,null,null,null,null,null,null,null,null,null,48486,54740,61267,null,null,null,71247,75856,null,null,null,null,null,null,null,null,94733,97925]
[null,null,null,null,null,null,null,null,null,null,null,null,null,null,null,48490,54743,61270,null,null,null,71248,75857,null,null,null,null,null,null,null,null,94734,97925]
[null,null,null,null,null,null,null,null,null,null,null,null,null,null,null,48491,54744,61273,null,null,null,71250,75858,null,null,null,null,null,null,null,null,94740,97925]
[null,null,null,null,null,null,null,null,null,null,null,null,null,null,null,48495,54745,61274,null,null,null,71253,75859,null,null,null,null,null,null,null,null,94743,97926]
[null,null,null,null,null,null,null,null,null,null,null,null,null,null,null,48496,54750,61275,null,null,null,71254,75860,null,null,null,null,null,null,null,null,94744,97926]
[null,null,null,null,null,null,null,null,null,null,null,null,null,null,null,48499,54753,61276,null,null,null,71255,75865,null,null,null,null,null,null,null,null,94745,97927]
[null,null,null,null,null,null,null,null,null,null,null,null,null,null,null,48500,54759,61277,null,null,null,71256,75867,null,null,null,null,null,null,null,null,94746,97927]
[null,null,null,null,null,null,null,null,null,null,null,null,null,null,null,48502,54760,61279,null,null,null,71260,75870,null,null,null,null,null,null,null,null,94748,97929]
[null,null,null,null,null,null,null,null,null,null,null,null,null,null,null,48503,54763,61280,null,null,null,71265,75873,null,null,null,null,null,null,null,null,94750,97929]
[null,null,null,null,null,null,null,null,null,null,null,null,null,null,null,48504,54764,61282,null,null,null,71266,75874,null,null,null,null,null,null,null,null,94755,97930]
[null,null,null,null,null,null,null,null,null,null,null,null,null,null,null,48506,54765,61283,null,null,null,71267,75875,null,null,null,null,null,null,null,null,94756,97930]
[null,null,null,null,null,null,null,null,null,null,null,null,null,null,null,48507,54766,61284,null,null,null,71268,75876,null,null,null,null,null,null,null,null,94760,97930]
[null,null,null,null,null,null,null,null,null,null,null,null,null,null,null,48508,54767,61285,null,null,null,71270,75877,null,null,null,null,null,null,null,null,94762,97930]
[null,null,null,null,null,null,null,null,null,null,null,null,null,null,null,48509,54769,61286,null,null,null,71273,75878,null,null,null,null,null,null,null,null,94763,97930]
[null,null,null,null,null,null,null,null,null,null,null,null,null,null,null,48510,54770,61287,null,null,null,71274,75879,null,null,null,null,null,null,null,null,94764,97930]
[null,null,null,null,null,null,null,null,null,null,null,null,null,null,null,48512,54783,61288,null,null,null,71275,75880,null,null,null,null,null,null,null,null,94765,97930]
[null,null,null,null,null,null,null,null,null,null,null,null,null,null,null,48520,54784,61290,null,null,null,71276,75885,null,null,null,null,null,null,null,null,94766,97930]
[null,null,null,null,null,null,null,null,null,null,null,null,null,null,null,48525,54785,61292,null,null,null,71277,75886,null,null,null,null,null,null,null,null,94767,97930]
[null,null,null,null,null,null,null,null,null,null,null,null,null,null,null,48526,54786,61293,null,null,null,71280,75890,null,null,null,null,null,null,null,null,94768,97930]
[null,null,null,null,null,null,null,null,null,null,null,null,null,null,null,48530,54800,61294,null,null,null,71283,75894,null,null,null,null,null,null,null,null,94769,97930]
[null,null,null,null,null,null,null,null,null,null,null,null,null,null,null,48532,54803,61295,null,null,null,71284,75895,null,null,null,null,null,null,null,null,94770,97932]
[null,null,null,null,null,null,null,null,null,null,null,null,null,null,null,48540,54804,61296,null,null,null,71286,75896,null,null,null,null,null,null,null,null,94772,97933]
[null,null,null,null,null,null,null,null,null,null,null,null,null,null,null,48542,54805,61297,null,null,null,71290,75897,null,null,null,null,null,null,null,null,94773,97933]
[null,null,null,null,null,null,null,null,null,null,null,null,null,null,null,48546,54807,61300,null,null,null,71292,75898,null,null,null,null,null,null,null,null,94774,97933]
[null,null,null,null,null,null,null,null,null,null,null,null,null,null,null,48550,54830,61303,null,null,null,71294,75900,null,null,null,null,null,null,null,null,94775,97933]
[null,null,null,null,null,null,null,null,null,null,null,null,null,null,null,48553,54831,61304,null,null,null,71295,75904,null,null,null,null,null,null,null,null,94776,97933]
[null,null,null,null,null,null,null,null,null,null,null,null,null,null,null,48554,54834,61305,null,null,null,71297,75905,null,null,null,null,null,null,null,null,94777,97934]
[null,null,null,null,null,null,null,null,null,null,null,null,null,null,null,48555,54835,61306,null,null,null,71300,75906,null,null,null,null,null,null,null,null,94780,97934]
[null,null,null,null,null,null,null,null,null,null,null,null,null,null,null,48556,54836,61307,null,null,null,71305,75907,null,null,null,null,null,null,null,null,94782,97934]
[null,null,null,null,null,null,null,null,null,null,null,null,null,null,null,48558,54840,61310,null,null,null,71306,75908,null,null,null,null,null,null,null,null,94783,97934]
[null,null,null,null,null,null,null,null,null,null,null,null,null,null,null,48559,54850,61311,null,null,null,71307,75909,null,null,null,null,null,null,null,null,94790,97934]
[null,null,null,null,null,null,null,null,null,null,null,null,null,null,null,48560,54855,61312,null,null,null,71308,75910,null,null,null,null,null,null,null,null,94793,97935]
[null,null,null,null,null,null,null,null,null,null,null,null,null,null,null,48563,54857,61313,null,null,null,71310,75914,null,null,null,null,null,null,null,null,94794,97935]
[null,null,null,null,null,null,null,null,null,null,null,null,null,null,null,48564,54858,61314,null,null,null,71313,75915,null,null,null,null,null,null,null,null,94800,97935]
[null,null,null,null,null,null,null,null,null,null,null,null,null,null,null,48568,54860,61320,null,null,null,71314,75916,null,null,null,null,null,null,null,null,94803,97935]
[null,null,null,null,null,null,null,null,null,null,null,null,null,null,null,48569,54870,61321,null,null,null,71315,75917,null,null,null,null,null,null,null,null,94804,97935]
[null,null,null,null,null,null,null,null,null,null,null,null,null,null,null,48570,54875,61322,null,null,null,71316,75920,null,null,null,null,null,null,null,null,94805,97935]
[null,null,null,null,null,null,null,null,null,null,null,null,null,null,null,48575,54877,61323,null,null,null,71317,75921,null,null,null,null,null,null,null,null,94806,97935]
[null,null,null,null,null,null,null,null,null,null,null,null,null,null,null,48577,54878,61324,null,null,null,71318,75922,null,null,null,null,null,null,null,null,94807,97936]
[null,null,null,null,null,null,null,null,null,null,null,null,null,null,null,48580,54879,61325,null,null,null,71320,75923,null,null,null,null,null,null,null,null,94808,97936]
[null,null,null,null,null,null,null,null,null,null,null,null,null,null,null,48585,54880,61326,null,null,null,71323,75924,null,null,null,null,null,null,null,null,94810,97936]
[null,null,null,null,null,null,null,null,null,null,null,null,null,null,null,48590,54882,61327,null,null,null,71324,75925,null,null,null,null,null,null,null,null,94813,97936]
[null,null,null,null,null,null,null,null,null,null,null,null,null,null,null,48592,54883,61328,null,null,null,71326,75926,null,null,null,null,null,null,null,null,94814,97936]
[null,null,null,null,null,null,null,null,null,null,null,null,null,null,null,48595,54884,61330,null,null,null,71327,75930,null,null,null,null,null,null,null,null,94815,97936]
[null,null,null,null,null,null,null,null,null,null,null,null,null,null,null,48600,54890,61333,null,null,null,71328,75933,null,null,null,null,null,null,null,null,94816,97936]
[null,null,null,null,null,null,null,null,null,null,null,null,null,null,null,48605,54893,61334,null,null,null,71330,75934,null,null,null,null,null,null,null,null,94820,97937]
[null,null,null,null,null,null,null,null,null,null,null,null,null,null,null,48610,54894,61335,null,null,null,71333,75935,null,null,null,null,null,null,null,null,94823,97937]
[null,null,null,null,null,null,null,null,null,null,null,null,null,null,null,48615,54900,61336,null,null,null,71334,75936,null,null,null,null,null,null,null,null,94824,97937]
[null,null,null,null,null,null,null,null,null,null,null,null,null,null,null,48620,54910,61337,null,null,null,71336,75937,null,null,null,null,null,null,null,null,94825,97937]
[null,null,null,null,null,null,null,null,null,null,null,null,null,null,null,48625,54913,61340,null,null,null,71337,75940,null,null,null,null,null,null,null,null,94830,97937]
[null,null,null,null,null,null,null,null,null,null,null,null,null,null,null,48628,54914,61341,null,null,null,71338,75941,null,null,null,null,null,null,null,null,94833,97937]
[null,null,null,null,null,null,null,null,null,null,null,null,null,null,null,48630,54915,61343,null,null,null,71340,75943,null,null,null,null,null,null,null,null,94834,97937]
[null,null,null,null,null,null,null,null,null,null,null,null,null,null,null,48634,54916,61344,null,null,null,71343,75944,null,null,null,null,null,null,null,null,94835,97937]
[null,null,null,null,null,null,null,null,null,null,null,null,null,null,null,48635,54918,61345,null,null,null,71344,75945,null,null,null,null,null,null,null,null,94836,97937]
[null,null,null,null,null,null,null,null,null,null,null,null,null,null,null,48640,54920,61346,null,null,null,71345,75947,null,null,null,null,null,null,null,null,94837,97937]
[null,null,null,null,null,null,null,null,null,null,null,null,null,null,null,48644,54924,61347,null,null,null,71346,75949,null,null,null,null,null,null,null,null,94840,97937]
[null,null,null,null,null,null,null,null,null,null,null,null,null,null,null,48650,54925,61350,null,null,null,71347,75950,null,null,null,null,null,null,null,null,94842,97937]
[null,null,null,null,null,null,null,null,null,null,null,null,null,null,null,48654,54926,61353,null,null,null,71350,75960,null,null,null,null,null,null,null,null,94843,97940]
[null,null,null,null,null,null,null,null,null,null,null,null,null,null,null,48655,54927,61354,null,null,null,71352,75970,null,null,null,null,null,null,null,null,94845,97943]
[null,null,null,null,null,null,null,null,null,null,null,null,null,null,null,48670,54929,61355,null,null,null,71354,75972,null,null,null,null,null,null,null,null,94846,97943]
[null,null,null,null,null,null,null,null,null,null,null,null,null,null,null,48679,54930,61356,null,null,null,71355,75973,null,null,null,null,null,null,null,null,94847,97943]
[null,null,null,null,null,null,null,null,null,null,null,null,null,null,null,48680,54932,61357,null,null,null,71357,75975,null,null,null,null,null,null,null,null,94850,97943]
[null,null,null,null,null,null,null,null,null,null,null,null,null,null,null,48685,54933,61358,null,null,null,71359,75980,null,null,null,null,null,null,null,null,94853,97944]
[null,null,null,null,null,null,null,null,null,null,null,null,null,null,null,48686,54934,61360,null,null,null,71360,75981,null,null,null,null,null,null,null,null,94854,97945]
[null,null,null,null,null,null,null,null,null,null,null,null,null,null,null,48687,54935,61363,null,null,null,71363,75985,null,null,null,null,null,null,null,null,94860,97947]
[null,null,null,null,null,null,null,null,null,null,null,null,null,null,null,48700,54938,61364,null,null,null,71364,75986,null,null,null,null,null,null,null,null,94862,97948]
[null,null,null,null,null,null,null,null,null,null,null,null,null,null,null,48708,54939,61365,null,null,null,71365,75987,null,null,null,null,null,null,null,null,94870,97948]
[null,null,null,null,null,null,null,null,null,null,null,null,null,null,null,48710,54940,61366,null,null,null,71366,75988,null,null,null,null,null,null,null,null,94873,97950]
[null,null,null,null,null,null,null,null,null,null,null,null,null,null,null,48715,54942,61367,null,null,null,71367,75989,null,null,null,null,null,null,null,null,94875,97953]
[null,null,null,null,null,null,null,null,null,null,null,null,null,null,null,48720,54943,61368,null,null,null,71368,75990,null,null,null,null,null,null,null,null,94877,97953]
[null,null,null,null,null,null,null,null,null,null,null,null,null,null,null,48725,54944,61370,null,null,null,71370,75991,null,null,null,null,null,null,null,null,94880,97953]
[null,null,null,null,null,null,null,null,null,null,null,null,null,null,null,48730,54945,61373,null,null,null,71372,75993,null,null,null,null,null,null,null,null,94883,97953]
[null,null,null,null,null,null,null,null,null,null,null,null,null,null,null,48739,54946,61374,null,null,null,71373,75994,null,null,null,null,null,null,null,null,94890,97953]
[null,null,null,null,null,null,null,null,null,null,null,null,null,null,null,48740,54947,61375,null,null,null,71374,75995,null,null,null,null,null,null,null,null,94893,97953]
[null,null,null,null,null,null,null,null,null,null,null,null,null,null,null,48742,54948,61376,null,null,null,71375,75996,null,null,null,null,null,null,null,null,94900,97954]
[null,null,null,null,null,null,null,null,null,null,null,null,null,null,null,48743,54949,61377,null,null,null,71376,75997,null,null,null,null,null,null,null,null,94902,97955]
[null,null,null,null,null,null,null,null,null,null,null,null,null,null,null,48744,54950,61378,null,null,null,71378,null,null,null,null,null,null,null,null,null,94903,97956]
[null,null,null,null,null,null,null,null,null,null,null,null,null,null,null,48745,54954,61380,null,null,null,71380,null,null,null,null,null,null,null,null,null,94904,97957]
[null,null,null,null,null,null,null,null,null,null,null,null,null,null,null,48747,54955,61383,null,null,null,71382,null,null,null,null,null,null,null,null,null,94905,97960]
[null,null,null,null,null,null,null,null,null,null,null,null,null,null,null,48748,54957,61384,null,null,null,71383,null,null,null,null,null,null,null,null,null,94906,97960]
[null,null,null,null,null,null,null,null,null,null,null,null,null,null,null,48750,54958,61385,null,null,null,71384,null,null,null,null,null,null,null,null,null,94907,97963]
[null,null,null,null,null,null,null,null,null,null,null,null,null,null,null,48753,54959,61386,null,null,null,71385,null,null,null,null,null,null,null,null,null,94910,97963]
[null,null,null,null,null,null,null,null,null,null,null,null,null,null,null,48760,54960,61387,null,null,null,71386,null,null,null,null,null,null,null,null,null,94912,97963]
[null,null,null,null,null,null,null,null,null,null,null,null,null,null,null,48763,54962,61390,null,null,null,71387,null,null,null,null,null,null,null,null,null,94913,97963]
[null,null,null,null,null,null,null,null,null,null,null,null,null,null,null,48764,54963,61393,null,null,null,71388,null,null,null,null,null,null,null,null,null,94915,97964]
[null,null,null,null,null,null,null,null,null,null,null,null,null,null,null,48765,54964,61394,null,null,null,71390,null,null,null,null,null,null,null,null,null,94916,97964]
[null,null,null,null,null,null,null,null,null,null,null,null,null,null,null,48766,54965,61395,null,null,null,71393,null,null,null,null,null,null,null,null,null,94917,97964]
[null,null,null,null,null,null,null,null,null,null,null,null,null,null,null,48767,54966,61396,null,null,null,71394,null,null,null,null,null,null,null,null,null,94918,97964]
[null,null,null,null,null,null,null,null,null,null,null,null,null,null,null,48768,54967,61397,null,null,null,71395,null,null,null,null,null,null,null,null,null,94920,97964]
[null,null,null,null,null,null,null,null,null,null,null,null,null,null,null,48769,54970,61398,null,null,null,71397,null,null,null,null,null,null,null,null,null,94925,97965]
[null,null,null,null,null,null,null,null,null,null,null,null,null,null,null,48770,54972,61399,null,null,null,71398,null,null,null,null,null,null,null,null,null,94928,97965]
[null,null,null,null,null,null,null,null,null,null,null,null,null,null,null,48775,54974,61400,null,null,null,71399,null,null,null,null,null,null,null,null,null,94929,97965]
[null,null,null,null,null,null,null,null,null,null,null,null,null,null,null,48777,54975,61402,null,null,null,71400,null,null,null,null,null,null,null,null,null,94930,97965]
[null,null,null,null,null,null,null,null,null,null,null,null,null,null,null,48778,54976,61403,null,null,null,71403,null,null,null,null,null,null,null,null,null,94933,97966]
[null,null,null,null,null,null,null,null,null,null,null,null,null,null,null,48780,54977,61404,null,null,null,71404,null,null,null,null,null,null,null,null,null,94934,97966]
[null,null,null,null,null,null,null,null,null,null,null,null,null,null,null,48785,54980,61405,null,null,null,71405,null,null,null,null,null,null,null,null,null,94935,97966]
[null,null,null,null,null,null,null,null,null,null,null,null,null,null,null,48786,54983,61410,null,null,null,71406,null,null,null,null,null,null,null,null,null,94936,97967]
[null,null,null,null,null,null,null,null,null,null,null,null,null,null,null,48788,54984,61413,null,null,null,71408,null,null,null,null,null,null,null,null,null,94937,97967]
[null,null,null,null,null,null,null,null,null,null,null,null,null,null,null,48790,54985,61414,null,null,null,71409,null,null,null,null,null,null,null,null,null,94938,97967]
[null,null,null,null,null,null,null,null,null,null,null,null,null,null,null,48793,54986,61415,null,null,null,71410,null,null,null,null,null,null,null,null,null,94939,97967]
[null,null,null,null,null,null,null,null,null,null,null,null,null,null,null,48795,54987,61416,null,null,null,71413,null,null,null,null,null,null,null,null,null,94940,97969]
[null,null,null,null,null,null,null,null,null,null,null,null,null,null,null,48800,54990,61417,null,null,null,71414,null,null,null,null,null,null,null,null,null,94943,97970]
[null,null,null,null,null,null,null,null,null,null,null,null,null,null,null,48802,55000,61420,null,null,null,71415,null,null,null,null,null,null,null,null,null,94944,97970]
[null,null,null,null,null,null,null,null,null,null,null,null,null,null,null,48803,55010,61423,null,null,null,71416,null,null,null,null,null,null,null,null,null,94945,97970]
[null,null,null,null,null,null,null,null,null,null,null,null,null,null,null,48804,55014,61424,null,null,null,71417,null,null,null,null,null,null,null,null,null,94946,97970]
[null,null,null,null,null,null,null,null,null,null,null,null,null,null,null,48805,55016,61425,null,null,null,71418,null,null,null,null,null,null,null,null,null,94950,97970]
[null,null,null,null,null,null,null,null,null,null,null,null,null,null,null,48806,55017,61426,null,null,null,71420,null,null,null,null,null,null,null,null,null,94953,97970]
[null,null,null,null,null,null,null,null,null,null,null,null,null,null,null,48815,55018,61427,null,null,null,71423,null,null,null,null,null,null,null,null,null,94954,97970]
[null,null,null,null,null,null,null,null,null,null,null,null,null,null,null,48816,55020,61428,null,null,null,71424,null,null,null,null,null,null,null,null,null,94955,97970]
[null,null,null,null,null,null,null,null,null,null,null,null,null,null,null,48820,55023,61430,null,null,null,71425,null,null,null,null,null,null,null,null,null,94956,97970]
[null,null,null,null,null,null,null,null,null,null,null,null,null,null,null,48823,55024,61434,null,null,null,71427,null,null,null,null,null,null,null,null,null,94957,97970]
[null,null,null,null,null,null,null,null,null,null,null,null,null,null,null,48824,55025,61435,null,null,null,71430,null,null,null,null,null,null,null,null,null,94959,97970]
[null,null,null,null,null,null,null,null,null,null,null,null,null,null,null,48825,55027,61436,null,null,null,71437,null,null,null,null,null,null,null,null,null,94960,97970]
[null,null,null,null,null,null,null,null,null,null,null,null,null,null,null,48826,55028,61437,null,null,null,71440,null,null,null,null,null,null,null,null,null,94964,97970]
[null,null,null,null,null,null,null,null,null,null,null,null,null,null,null,48827,55029,61438,null,null,null,71450,null,null,null,null,null,null,null,null,null,94965,97970]
[null,null,null,null,null,null,null,null,null,null,null,null,null,null,null,48830,55030,61440,null,null,null,71453,null,null,null,null,null,null,null,null,null,94966,97970]
[null,null,null,null,null,null,null,null,null,null,null,null,null,null,null,48833,55036,61443,null,null,null,71454,null,null,null,null,null,null,null,null,null,94967,97970]
[null,null,null,null,null,null,null,null,null,null,null,null,null,null,null,48835,55037,61444,null,null,null,71457,null,null,null,null,null,null,null,null,null,94968,97970]
[null,null,null,null,null,null,null,null,null,null,null,null,null,null,null,48836,55038,61445,null,null,null,71459,null,null,null,null,null,null,null,null,null,94970,97973]
[null,null,null,null,null,null,null,null,null,null,null,null,null,null,null,48837,55039,61446,null,null,null,71460,null,null,null,null,null,null,null,null,null,94972,97973]
[null,null,null,null,null,null,null,null,null,null,null,null,null,null,null,48840,55040,61447,null,null,null,71461,null,null,null,null,null,null,null,null,null,94973,97973]
[null,null,null,null,null,null,null,null,null,null,null,null,null,null,null,48843,55050,61450,null,null,null,71465,null,null,null,null,null,null,null,null,null,94974,97973]
[null,null,null,null,null,null,null,null,null,null,null,null,null,null,null,48844,55055,61453,null,null,null,71470,null,null,null,null,null,null,null,null,null,94975,97974]
[null,null,null,null,null,null,null,null,null,null,null,null,null,null,null,48845,55056,61454,null,null,null,71480,null,null,null,null,null,null,null,null,null,94976,97975]
[null,null,null,null,null,null,null,null,null,null,null,null,null,null,null,48847,55059,61455,null,null,null,71483,null,null,null,null,null,null,null,null,null,94977,97975]
[null,null,null,null,null,null,null,null,null,null,null,null,null,null,null,48850,55060,61458,null,null,null,71490,null,null,null,null,null,null,null,null,null,94978,97977]
[null,null,null,null,null,null,null,null,null,null,null,null,null,null,null,48860,55063,61460,null,null,null,71492,null,null,null,null,null,null,null,null,null,94980,97977]
[null,null,null,null,null,null,null,null,null,null,null,null,null,null,null,48862,55064,61464,null,null,null,71493,null,null,null,null,null,null,null,null,null,94983,97977]
[null,null,null,null,null,null,null,null,null,null,null,null,null,null,null,48865,55065,61465,null,null,null,71494,null,null,null,null,null,null,null,null,null,94984,97979]
[null,null,null,null,null,null,null,null,null,null,null,null,null,null,null,48867,55066,61467,null,null,null,71500,null,null,null,null,null,null,null,null,null,94985,97979]
[null,null,null,null,null,null,null,null,null,null,null,null,null,null,null,48868,55067,61468,null,null,null,71502,null,null,null,null,null,null,null,null,null,94986,97980]
[null,null,null,null,null,null,null,null,null,null,null,null,null,null,null,48869,55068,61470,null,null,null,71504,null,null,null,null,null,null,null,null,null,94987,97980]
[null,null,null,null,null,null,null,null,null,null,null,null,null,null,null,48870,55069,61472,null,null,null,71505,null,null,null,null,null,null,null,null,null,94988,97980]
[null,null,null,null,null,null,null,null,null,null,null,null,null,null,null,48872,55070,61473,null,null,null,71506,null,null,null,null,null,null,null,null,null,94989,97980]
[null,null,null,null,null,null,null,null,null,null,null,null,null,null,null,48878,55074,61474,null,null,null,71507,null,null,null,null,null,null,null,null,null,94990,97983]
[null,null,null,null,null,null,null,null,null,null,null,null,null,null,null,48880,55075,61475,null,null,null,71508,null,null,null,null,null,null,null,null,null,94992,97983]
[null,null,null,null,null,null,null,null,null,null,null,null,null,null,null,48889,55076,61477,null,null,null,71510,null,null,null,null,null,null,null,null,null,94993,97983]
[null,null,null,null,null,null,null,null,null,null,null,null,null,null,null,48890,55080,61480,null,null,null,71512,null,null,null,null,null,null,null,null,null,94994,97983]
[null,null,null,null,null,null,null,null,null,null,null,null,null,null,null,48892,55084,61483,null,null,null,71514,null,null,null,null,null,null,null,null,null,94995,97983]
[null,null,null,null,null,null,null,null,null,null,null,null,null,null,null,48893,55085,61484,null,null,null,71515,null,null,null,null,null,null,null,null,null,94996,97983]
[null,null,null,null,null,null,null,null,null,null,null,null,null,null,null,48896,55087,61485,null,null,null,71516,null,null,null,null,null,null,null,null,null,94997,97983]
[null,null,null,null,null,null,null,null,null,null,null,null,null,null,null,48898,55090,61486,null,null,null,71517,null,null,null,null,null,null,null,null,null,95000,97983]
[null,null,null,null,null,null,null,null,null,null,null,null,null,null,null,48900,55094,61487,null,null,null,71518,null,null,null,null,null,null,null,null,null,95002,97984]
[null,null,null,null,null,null,null,null,null,null,null,null,null,null,null,48902,55095,61490,null,null,null,71520,null,null,null,null,null,null,null,null,null,95003,97984]
[null,null,null,null,null,null,null,null,null,null,null,null,null,null,null,48903,55100,61493,null,null,null,71523,null,null,null,null,null,null,null,null,null,95004,97984]
[null,null,null,null,null,null,null,null,null,null,null,null,null,null,null,48904,55104,61498,null,null,null,71525,null,null,null,null,null,null,null,null,null,95005,97984]
[null,null,null,null,null,null,null,null,null,null,null,null,null,null,null,48905,55105,61500,null,null,null,71526,null,null,null,null,null,null,null,null,null,95006,97985]
[null,null,null,null,null,null,null,null,null,null,null,null,null,null,null,48906,55107,61502,null,null,null,71528,null,null,null,null,null,null,null,null,null,95007,97986]
[null,null,null,null,null,null,null,null,null,null,null,null,null,null,null,48907,55114,61503,null,null,null,71529,null,null,null,null,null,null,null,null,null,95009,97987]
[null,null,null,null,null,null,null,null,null,null,null,null,null,null,null,48908,55115,61505,null,null,null,71530,null,null,null,null,null,null,null,null,null,95010,97987]
[null,null,null,null,null,null,null,null,null,null,null,null,null,null,null,48909,55117,61506,null,null,null,71534,null,null,null,null,null,null,null,null,null,95011,97987]
[null,null,null,null,null,null,null,null,null,null,null,null,null,null,null,48910,55118,61507,null,null,null,71537,null,null,null,null,null,null,null,null,null,95012,97987]
[null,null,null,null,null,null,null,null,null,null,null,null,null,null,null,48914,55119,61508,null,null,null,71540,null,null,null,null,null,null,null,null,null,95013,97987]
[null,null,null,null,null,null,null,null,null,null,null,null,null,null,null,48915,55120,61509,null,null,null,71543,null,null,null,null,null,null,null,null,null,95016,97989]
[null,null,null,null,null,null,null,null,null,null,null,null,null,null,null,48916,55125,61510,null,null,null,71545,null,null,null,null,null,null,null,null,null,95017,97990]
[null,null,null,null,null,null,null,null,null,null,null,null,null,null,null,48917,55126,61511,null,null,null,71548,null,null,null,null,null,null,null,null,null,95019]
[null,null,null,null,null,null,null,null,null,null,null,null,null,null,null,48918,55127,61512,null,null,null,71550,null,null,null,null,null,null,null,null,null,95024]
[null,null,null,null,null,null,null,null,null,null,null,null,null,null,null,48919,55128,61514,null,null,null,71552,null,null,null,null,null,null,null,null,null,95025]
[null,null,null,null,null,null,null,null,null,null,null,null,null,null,null,48920,55129,61515,null,null,null,71553,null,null,null,null,null,null,null,null,null,95026]
[null,null,null,null,null,null,null,null,null,null,null,null,null,null,null,48922,55130,61516,null,null,null,71554,null,null,null,null,null,null,null,null,null,95027]
[null,null,null,null,null,null,null,null,null,null,null,null,null,null,null,48923,55135,61517,null,null,null,71557,null,null,null,null,null,null,null,null,null,95030]
[null,null,null,null,null,null,null,null,null,null,null,null,null,null,null,48926,55137,61518,null,null,null,71560,null,null,null,null,null,null,null,null,null,95033]
[null,null,null,null,null,null,null,null,null,null,null,null,null,null,null,48930,55138,61519,null,null,null,71562,null,null,null,null,null,null,null,null,null,95034]
[null,null,null,null,null,null,null,null,null,null,null,null,null,null,null,48936,55139,61520,null,null,null,71565,null,null,null,null,null,null,null,null,null,95035]
[null,null,null,null,null,null,null,null,null,null,null,null,null,null,null,48938,55140,61524,null,null,null,71566,null,null,null,null,null,null,null,null,null,95036]
[null,null,null,null,null,null,null,null,null,null,null,null,null,null,null,48939,55146,61525,null,null,null,71567,null,null,null,null,null,null,null,null,null,95037]
[null,null,null,null,null,null,null,null,null,null,null,null,null,null,null,48940,55147,61526,null,null,null,71568,null,null,null,null,null,null,null,null,null,95038]
[null,null,null,null,null,null,null,null,null,null,null,null,null,null,null,48942,55148,61527,null,null,null,71569,null,null,null,null,null,null,null,null,null,95039]
[null,null,null,null,null,null,null,null,null,null,null,null,null,null,null,48943,55149,61528,null,null,null,71570,null,null,null,null,null,null,null,null,null,95040]
[null,null,null,null,null,null,null,null,null,null,null,null,null,null,null,48944,55158,61529,null,null,null,71573,null,null,null,null,null,null,null,null,null,95042]
[null,null,null,null,null,null,null,null,null,null,null,null,null,null,null,48945,55170,61530,null,null,null,71574,null,null,null,null,null,null,null,null,null,95043]
[null,null,null,null,null,null,null,null,null,null,null,null,null,null,null,48946,55176,61533,null,null,null,71575,null,null,null,null,null,null,null,null,null,95044]
[null,null,null,null,null,null,null,null,null,null,null,null,null,null,null,48947,55180,61534,null,null,null,71576,null,null,null,null,null,null,null,null,null,95045]
[null,null,null,null,null,null,null,null,null,null,null,null,null,null,null,48948,55187,61535,null,null,null,71577,null,null,null,null,null,null,null,null,null,95046]
[null,null,null,null,null,null,null,null,null,null,null,null,null,null,null,48950,55188,61536,null,null,null,71578,null,null,null,null,null,null,null,null,null,95048]
[null,null,null,null,null,null,null,null,null,null,null,null,null,null,null,48953,55189,61537,null,null,null,71580,null,null,null,null,null,null,null,null,null,95049]
[null,null,null,null,null,null,null,null,null,null,null,null,null,null,null,48954,55190,61538,null,null,null,71586,null,null,null,null,null,null,null,null,null,95060]
[null,null,null,null,null,null,null,null,null,null,null,null,null,null,null,48955,55200,61539,null,null,null,71588,null,null,null,null,null,null,null,null,null,95061]
[null,null,null,null,null,null,null,null,null,null,null,null,null,null,null,48959,55210,61540,null,null,null,71590,null,null,null,null,null,null,null,null,null,95063]
[null,null,null,null,null,null,null,null,null,null,null,null,null,null,null,48960,55218,61543,null,null,null,71595,null,null,null,null,null,null,null,null,null,95064]
[null,null,null,null,null,null,null,null,null,null,null,null,null,null,null,48962,55220,61544,null,null,null,71597,null,null,null,null,null,null,null,null,null,95065]
[null,null,null,null,null,null,null,null,null,null,null,null,null,null,null,48963,55230,61545,null,null,null,71600,null,null,null,null,null,null,null,null,null,95066]
[null,null,null,null,null,null,null,null,null,null,null,null,null,null,null,48964,55234,61546,null,null,null,71602,null,null,null,null,null,null,null,null,null,95067]
[null,null,null,null,null,null,null,null,null,null,null,null,null,null,null,48965,55235,61547,null,null,null,71603,null,null,null,null,null,null,null,null,null,95070]
[null,null,null,null,null,null,null,null,null,null,null,null,null,null,null,48966,55236,61548,null,null,null,71604,null,null,null,null,null,null,null,null,null,95074]
[null,null,null,null,null,null,null,null,null,null,null,null,null,null,null,48967,55237,61549,null,null,null,71605,null,null,null,null,null,null,null,null,null,95075]
[null,null,null,null,null,null,null,null,null,null,null,null,null,null,null,48970,55238,61550,null,null,null,71606,null,null,null,null,null,null,null,null,null,95077]
[null,null,null,null,null,null,null,null,null,null,null,null,null,null,null,48972,55240,61553,null,null,null,71607,null,null,null,null,null,null,null,null,null,95080]
[null,null,null,null,null,null,null,null,null,null,null,null,null,null,null,48974,55242,61554,null,null,null,71608,null,null,null,null,null,null,null,null,null,95083]
[null,null,null,null,null,null,null,null,null,null,null,null,null,null,null,48980,55243,61555,null,null,null,71610,null,null,null,null,null,null,null,null,null,95084]
[null,null,null,null,null,null,null,null,null,null,null,null,null,null,null,48983,55244,61556,null,null,null,71612,null,null,null,null,null,null,null,null,null,95085]
[null,null,null,null,null,null,null,null,null,null,null,null,null,null,null,48985,55245,61557,null,null,null,71613,null,null,null,null,null,null,null,null,null,95086]
[null,null,null,null,null,null,null,null,null,null,null,null,null,null,null,48986,55246,61560,null,null,null,71615,null,null,null,null,null,null,null,null,null,95090]
[null,null,null,null,null,null,null,null,null,null,null,null,null,null,null,48987,55247,61563,null,null,null,71620,null,null,null,null,null,null,null,null,null,95093]
[null,null,null,null,null,null,null,null,null,null,null,null,null,null,null,48989,55248,61564,null,null,null,71624,null,null,null,null,null,null,null,null,null,95094]
[null,null,null,null,null,null,null,null,null,null,null,null,null,null,null,48990,55249,61565,null,null,null,71630,null,null,null,null,null,null,null,null,null,95095]
[null,null,null,null,null,null,null,null,null,null,null,null,null,null,null,48995,55260,61570,null,null,null,71631,null,null,null,null,null,null,null,null,null,95096]
[null,null,null,null,null,null,null,null,null,null,null,null,null,null,null,49000,55264,61573,null,null,null,71640,null,null,null,null,null,null,null,null,null,95097]
[null,null,null,null,null,null,null,null,null,null,null,null,null,null,null,49010,55266,61575,null,null,null,71641,null,null,null,null,null,null,null,null,null,95098]
[null,null,null,null,null,null,null,null,null,null,null,null,null,null,null,49011,55267,61577,null,null,null,71642,null,null,null,null,null,null,null,null,null,95099]
[null,null,null,null,null,null,null,null,null,null,null,null,null,null,null,49012,55268,61578,null,null,null,71643,null,null,null,null,null,null,null,null,null,95100]
[null,null,null,null,null,null,null,null,null,null,null,null,null,null,null,49013,55269,61580,null,null,null,71648,null,null,null,null,null,null,null,null,null,95110]
[null,null,null,null,null,null,null,null,null,null,null,null,null,null,null,49014,55270,61583,null,null,null,71650,null,null,null,null,null,null,null,null,null,95118]
[null,null,null,null,null,null,null,null,null,null,null,null,null,null,null,49015,55280,61585,null,null,null,71655,null,null,null,null,null,null,null,null,null,95119]
[null,null,null,null,null,null,null,null,null,null,null,null,null,null,null,49016,55284,61586,null,null,null,71656,null,null,null,null,null,null,null,null,null,95120]
[null,null,null,null,null,null,null,null,null,null,null,null,null,null,null,49019,55287,61587,null,null,null,71660,null,null,null,null,null,null,null,null,null,95130]
[null,null,null,null,null,null,null,null,null,null,null,null,null,null,null,49020,55288,61590,null,null,null,71670,null,null,null,null,null,null,null,null,null,95140]
[null,null,null,null,null,null,null,null,null,null,null,null,null,null,null,49023,55289,61592,null,null,null,71671,null,null,null,null,null,null,null,null,null,95150]
[null,null,null,null,null,null,null,null,null,null,null,null,null,null,null,49024,55290,61593,null,null,null,71675,null,null,null,null,null,null,null,null,null,95160]
[null,null,null,null,null,null,null,null,null,null,null,null,null,null,null,49026,55294,61594,null,null,null,71678,null,null,null,null,null,null,null,null,null,95170]
[null,null,null,null,null,null,null,null,null,null,null,null,null,null,null,49027,55295,61595,null,null,null,71680,null,null,null,null,null,null,null,null,null,95179]
[null,null,null,null,null,null,null,null,null,null,null,null,null,null,null,49028,55296,61596,null,null,null,71683,null,null,null,null,null,null,null,null,null,95180]
[null,null,null,null,null,null,null,null,null,null,null,null,null,null,null,49031,55297,61597,null,null,null,71684,null,null,null,null,null,null,null,null,null,95190]
[null,null,null,null,null,null,null,null,null,null,null,null,null,null,null,49032,55298,61600,null,null,null,71685,null,null,null,null,null,null,null,null,null,95193]
[null,null,null,null,null,null,null,null,null,null,null,null,null,null,null,49033,55299,61604,null,null,null,71686,null,null,null,null,null,null,null,null,null,95200]
[null,null,null,null,null,null,null,null,null,null,null,null,null,null,null,49035,55300,61605,null,null,null,71690,null,null,null,null,null,null,null,null,null,95202]
[null,null,null,null,null,null,null,null,null,null,null,null,null,null,null,49040,55308,61606,null,null,null,71699,null,null,null,null,null,null,null,null,null,95203]
[null,null,null,null,null,null,null,null,null,null,null,null,null,null,null,49050,55310,61607,null,null,null,71700,null,null,null,null,null,null,null,null,null,95204]
[null,null,null,null,null,null,null,null,null,null,null,null,null,null,null,49051,55316,61608,null,null,null,71702,null,null,null,null,null,null,null,null,null,95205]
[null,null,null,null,null,null,null,null,null,null,null,null,null,null,null,49052,55317,61609,null,null,null,71703,null,null,null,null,null,null,null,null,null,95206]
[null,null,null,null,null,null,null,null,null,null,null,null,null,null,null,49053,55320,61610,null,null,null,71704,null,null,null,null,null,null,null,null,null,95207]
[null,null,null,null,null,null,null,null,null,null,null,null,null,null,null,49055,55330,61611,null,null,null,71705,null,null,null,null,null,null,null,null,null,95209]
[null,null,null,null,null,null,null,null,null,null,null,null,null,null,null,49056,55338,61612,null,null,null,71706,null,null,null,null,null,null,null,null,null,95212]
[null,null,null,null,null,null,null,null,null,null,null,null,null,null,null,49057,55339,61613,null,null,null,71707,null,null,null,null,null,null,null,null,null,95213]
[null,null,null,null,null,null,null,null,null,null,null,null,null,null,null,49059,55340,61614,null,null,null,71708,null,null,null,null,null,null,null,null,null,95214]
[null,null,null,null,null,null,null,null,null,null,null,null,null,null,null,49060,55347,61615,null,null,null,71710,null,null,null,null,null,null,null,null,null,95215]
[null,null,null,null,null,null,null,null,null,null,null,null,null,null,null,49063,55348,61616,null,null,null,71713,null,null,null,null,null,null,null,null,null,95216]
[null,null,null,null,null,null,null,null,null,null,null,null,null,null,null,49064,55349,61617,null,null,null,71714,null,null,null,null,null,null,null,null,null,95217]
[null,null,null,null,null,null,null,null,null,null,null,null,null,null,null,49065,55360,61618,null,null,null,71715,null,null,null,null,null,null,null,null,null,95220]
[null,null,null,null,null,null,null,null,null,null,null,null,null,null,null,49066,55369,61620,null,null,null,71720,null,null,null,null,null,null,null,null,null,95223]
[null,null,null,null,null,null,null,null,null,null,null,null,null,null,null,49070,55390,61623,null,null,null,71721,null,null,null,null,null,null,null,null,null,95224]
[null,null,null,null,null,null,null,null,null,null,null,null,null,null,null,49075,55400,61624,null,null,null,71722,null,null,null,null,null,null,null,null,null,95225]
[null,null,null,null,null,null,null,null,null,null,null,null,null,null,null,49076,55404,61625,null,null,null,71724,null,null,null,null,null,null,null,null,null,95226]
[null,null,null,null,null,null,null,null,null,null,null,null,null,null,null,49077,55405,61626,null,null,null,71730,null,null,null,null,null,null,null,null,null,95227]
[null,null,null,null,null,null,null,null,null,null,null,null,null,null,null,49078,55407,61627,null,null,null,71733,null,null,null,null,null,null,null,null,null,95230]
[null,null,null,null,null,null,null,null,null,null,null,null,null,null,null,49079,55410,61630,null,null,null,71734,null,null,null,null,null,null,null,null,null,95233]
[null,null,null,null,null,null,null,null,null,null,null,null,null,null,null,49080,55414,61632,null,null,null,71735,null,null,null,null,null,null,null,null,null,95234]
[null,null,null,null,null,null,null,null,null,null,null,null,null,null,null,49086,55415,61633,null,null,null,71736,null,null,null,null,null,null,null,null,null,95235]
[null,null,null,null,null,null,null,null,null,null,null,null,null,null,null,49087,55416,61634,null,null,null,71737,null,null,null,null,null,null,null,null,null,95236]
[null,null,null,null,null,null,null,null,null,null,null,null,null,null,null,49088,55417,61636,null,null,null,71740,null,null,null,null,null,null,null,null,null,95237]
[null,null,null,null,null,null,null,null,null,null,null,null,null,null,null,49089,55418,61637,null,null,null,71741,null,null,null,null,null,null,null,null,null,95240]
[null,null,null,null,null,null,null,null,null,null,null,null,null,null,null,49090,55419,61640,null,null,null,71742,null,null,null,null,null,null,null,null,null,95243]
[null,null,null,null,null,null,null,null,null,null,null,null,null,null,null,49093,55420,61643,null,null,null,71743,null,null,null,null,null,null,null,null,null,95244]
[null,null,null,null,null,null,null,null,null,null,null,null,null,null,null,49094,55425,61644,null,null,null,71744,null,null,null,null,null,null,null,null,null,95245]
[null,null,null,null,null,null,null,null,null,null,null,null,null,null,null,49095,55429,61645,null,null,null,71747,null,null,null,null,null,null,null,null,null,95246]
[null,null,null,null,null,null,null,null,null,null,null,null,null,null,null,49096,55430,61646,null,null,null,71750,null,null,null,null,null,null,null,null,null,95247]
[null,null,null,null,null,null,null,null,null,null,null,null,null,null,null,49097,55450,61647,null,null,null,71757,null,null,null,null,null,null,null,null,null,95250]
[null,null,null,null,null,null,null,null,null,null,null,null,null,null,null,49098,55458,61648,null,null,null,71760,null,null,null,null,null,null,null,null,null,95253]
[null,null,null,null,null,null,null,null,null,null,null,null,null,null,null,49099,55459,61650,null,null,null,71761,null,null,null,null,null,null,null,null,null,95258]
[null,null,null,null,null,null,null,null,null,null,null,null,null,null,null,49100,55490,61652,null,null,null,71762,null,null,null,null,null,null,null,null,null,95259]
[null,null,null,null,null,null,null,null,null,null,null,null,null,null,null,49106,55498,61653,null,null,null,71763,null,null,null,null,null,null,null,null,null,95261]
[null,null,null,null,null,null,null,null,null,null,null,null,null,null,null,49109,55500,61654,null,null,null,71764,null,null,null,null,null,null,null,null,null,95263]
[null,null,null,null,null,null,null,null,null,null,null,null,null,null,null,49110,55506,61655,null,null,null,71765,null,null,null,null,null,null,null,null,null,95264]
[null,null,null,null,null,null,null,null,null,null,null,null,null,null,null,49112,55507,61656,null,null,null,71766,null,null,null,null,null,null,null,null,null,95265]
[null,null,null,null,null,null,null,null,null,null,null,null,null,null,null,49113,55508,61657,null,null,null,71768,null,null,null,null,null,null,null,null,null,95266]
[null,null,null,null,null,null,null,null,null,null,null,null,null,null,null,49120,55509,61658,null,null,null,71770,null,null,null,null,null,null,null,null,null,95267]
[null,null,null,null,null,null,null,null,null,null,null,null,null,null,null,49123,55510,61659,null,null,null,71771,null,null,null,null,null,null,null,null,null,95268]
[null,null,null,null,null,null,null,null,null,null,null,null,null,null,null,49124,55515,61663,null,null,null,71777,null,null,null,null,null,null,null,null,null,95269]
[null,null,null,null,null,null,null,null,null,null,null,null,null,null,null,49126,55516,61664,null,null,null,71780,null,null,null,null,null,null,null,null,null,95270]
[null,null,null,null,null,null,null,null,null,null,null,null,null,null,null,49130,55517,61665,null,null,null,71784,null,null,null,null,null,null,null,null,null,95272]
[null,null,null,null,null,null,null,null,null,null,null,null,null,null,null,49170,55518,61666,null,null,null,71785,null,null,null,null,null,null,null,null,null,95274]
[null,null,null,null,null,null,null,null,null,null,null,null,null,null,null,49175,55519,61667,null,null,null,71786,null,null,null,null,null,null,null,null,null,95275]
[null,null,null,null,null,null,null,null,null,null,null,null,null,null,null,49176,55520,61668,null,null,null,71787,null,null,null,null,null,null,null,null,null,95276]
[null,null,null,null,null,null,null,null,null,null,null,null,null,null,null,49177,55530,61670,null,null,null,71788,null,null,null,null,null,null,null,null,null,95277]
[null,null,null,null,null,null,null,null,null,null,null,null,null,null,null,49178,55540,61673,null,null,null,71789,null,null,null,null,null,null,null,null,null,95278]
[null,null,null,null,null,null,null,null,null,null,null,null,null,null,null,49200,55547,61674,null,null,null,71790,null,null,null,null,null,null,null,null,null,95280]
[null,null,null,null,null,null,null,null,null,null,null,null,null,null,null,49220,55548,61675,null,null,null,71791,null,null,null,null,null,null,null,null,null,95281]
[null,null,null,null,null,null,null,null,null,null,null,null,null,null,null,49223,55549,61676,null,null,null,71792,null,null,null,null,null,null,null,null,null,95283]
[null,null,null,null,null,null,null,null,null,null,null,null,null,null,null,49224,55600,61677,null,null,null,71799,null,null,null,null,null,null,null,null,null,95284]
[null,null,null,null,null,null,null,null,null,null,null,null,null,null,null,49225,55604,61678,null,null,null,71800,null,null,null,null,null,null,null,null,null,95285]
[null,null,null,null,null,null,null,null,null,null,null,null,null,null,null,49228,55605,61680,null,null,null,71801,null,null,null,null,null,null,null,null,null,95286]
[null,null,null,null,null,null,null,null,null,null,null,null,null,null,null,49229,55606,61682,null,null,null,71803,null,null,null,null,null,null,null,null,null,95287]
[null,null,null,null,null,null,null,null,null,null,null,null,null,null,null,49230,55607,61683,null,null,null,71804,null,null,null,null,null,null,null,null,null,95295]
[null,null,null,null,null,null,null,null,null,null,null,null,null,null,null,49236,55609,61684,null,null,null,71805,null,null,null,null,null,null,null,null,null,95300]
[null,null,null,null,null,null,null,null,null,null,null,null,null,null,null,49239,55610,61685,null,null,null,71806,null,null,null,null,null,null,null,null,null,95330]
[null,null,null,null,null,null,null,null,null,null,null,null,null,null,null,49240,55613,61686,null,null,null,71807,null,null,null,null,null,null,null,null,null,95332]
[null,null,null,null,null,null,null,null,null,null,null,null,null,null,null,49250,55614,61687,null,null,null,71809,null,null,null,null,null,null,null,null,null,95333]
[null,null,null,null,null,null,null,null,null,null,null,null,null,null,null,49253,55619,61688,null,null,null,71810,null,null,null,null,null,null,null,null,null,95334]
[null,null,null,null,null,null,null,null,null,null,null,null,null,null,null,49260,55620,61690,null,null,null,71814,null,null,null,null,null,null,null,null,null,95335]
[null,null,null,null,null,null,null,null,null,null,null,null,null,null,null,49265,55627,61693,null,null,null,71815,null,null,null,null,null,null,null,null,null,95336]
[null,null,null,null,null,null,null,null,null,null,null,null,null,null,null,49270,55628,61694,null,null,null,71817,null,null,null,null,null,null,null,null,null,95337]
[null,null,null,null,null,null,null,null,null,null,null,null,null,null,null,49274,55629,61695,null,null,null,71820,null,null,null,null,null,null,null,null,null,95338]
[null,null,null,null,null,null,null,null,null,null,null,null,null,null,null,49275,55630,61696,null,null,null,71821,null,null,null,null,null,null,null,null,null,95339]
[null,null,null,null,null,null,null,null,null,null,null,null,null,null,null,49276,55634,61697,null,null,null,71826,null,null,null,null,null,null,null,null,null,95340]
[null,null,null,null,null,null,null,null,null,null,null,null,null,null,null,49277,55635,61698,null,null,null,71830,null,null,null,null,null,null,null,null,null,95342]
[null,null,null,null,null,null,null,null,null,null,null,null,null,null,null,49280,55636,61700,null,null,null,71831,null,null,null,null,null,null,null,null,null,95343]
[null,null,null,null,null,null,null,null,null,null,null,null,null,null,null,49285,55637,61702,null,null,null,71833,null,null,null,null,null,null,null,null,null,95344]
[null,null,null,null,null,null,null,null,null,null,null,null,null,null,null,49286,55640,61703,null,null,null,71834,null,null,null,null,null,null,null,null,null,95345]
[null,null,null,null,null,null,null,null,null,null,null,null,null,null,null,49290,55650,61705,null,null,null,71835,null,null,null,null,null,null,null,null,null,95346]
[null,null,null,null,null,null,null,null,null,null,null,null,null,null,null,49295,55653,61706,null,null,null,71836,null,null,null,null,null,null,null,null,null,95347]
[null,null,null,null,null,null,null,null,null,null,null,null,null,null,null,49296,55654,61707,null,null,null,71837,null,null,null,null,null,null,null,null,null,95348]
[null,null,null,null,null,null,null,null,null,null,null,null,null,null,null,49300,55655,61708,null,null,null,71838,null,null,null,null,null,null,null,null,null,95349]
[null,null,null,null,null,null,null,null,null,null,null,null,null,null,null,49302,55656,61710,null,null,null,71840,null,null,null,null,null,null,null,null,null,95350]
[null,null,null,null,null,null,null,null,null,null,null,null,null,null,null,49303,55657,61712,null,null,null,71847,null,null,null,null,null,null,null,null,null,95353]
[null,null,null,null,null,null,null,null,null,null,null,null,null,null,null,49304,55660,61713,null,null,null,71850,null,null,null,null,null,null,null,null,null,95354]
[null,null,null,null,null,null,null,null,null,null,null,null,null,null,null,49305,55663,61714,null,null,null,71851,null,null,null,null,null,null,null,null,null,95355]
[null,null,null,null,null,null,null,null,null,null,null,null,null,null,null,49306,55664,61716,null,null,null,71853,null,null,null,null,null,null,null,null,null,95356]
[null,null,null,null,null,null,null,null,null,null,null,null,null,null,null,49310,55665,61717,null,null,null,71854,null,null,null,null,null,null,null,null,null,95357]
[null,null,null,null,null,null,null,null,null,null,null,null,null,null,null,49312,55666,61718,null,null,null,71870,null,null,null,null,null,null,null,null,null,95358]
[null,null,null,null,null,null,null,null,null,null,null,null,null,null,null,49313,55667,61730,null,null,null,71873,null,null,null,null,null,null,null,null,null,95360]
[null,null,null,null,null,null,null,null,null,null,null,null,null,null,null,49314,55670,61732,null,null,null,71890,null,null,null,null,null,null,null,null,null,95365]
[null,null,null,null,null,null,null,null,null,null,null,null,null,null,null,49315,55676,61734,null,null,null,71900,null,null,null,null,null,null,null,null,null,95367]
[null,null,null,null,null,null,null,null,null,null,null,null,null,null,null,49316,55679,61735,null,null,null,71901,null,null,null,null,null,null,null,null,null,95370]
[null,null,null,null,null,null,null,null,null,null,null,null,null,null,null,49317,55680,61740,null,null,null,71910,null,null,null,null,null,null,null,null,null,95372]
[null,null,null,null,null,null,null,null,null,null,null,null,null,null,null,49318,55683,61745,null,null,null,71913,null,null,null,null,null,null,null,null,null,95374]
[null,null,null,null,null,null,null,null,null,null,null,null,null,null,null,49330,55684,61746,null,null,null,71914,null,null,null,null,null,null,null,null,null,95375]
[null,null,null,null,null,null,null,null,null,null,null,null,null,null,null,49333,55685,61747,null,null,null,71915,null,null,null,null,null,null,null,null,null,95380]
[null,null,null,null,null,null,null,null,null,null,null,null,null,null,null,49334,55689,61750,null,null,null,71916,null,null,null,null,null,null,null,null,null,95385]
[null,null,null,null,null,null,null,null,null,null,null,null,null,null,null,49336,55690,61752,null,null,null,71917,null,null,null,null,null,null,null,null,null,95390]
[null,null,null,null,null,null,null,null,null,null,null,null,null,null,null,49339,55694,61753,null,null,null,71920,null,null,null,null,null,null,null,null,null,95392]
[null,null,null,null,null,null,null,null,null,null,null,null,null,null,null,49340,55697,61754,null,null,null,71923,null,null,null,null,null,null,null,null,null,95394]
[null,null,null,null,null,null,null,null,null,null,null,null,null,null,null,49344,55700,61755,null,null,null,71930,null,null,null,null,null,null,null,null,null,95395]
[null,null,null,null,null,null,null,null,null,null,null,null,null,null,null,49345,55705,61756,null,null,null,71940,null,null,null,null,null,null,null,null,null,95396]
[null,null,null,null,null,null,null,null,null,null,null,null,null,null,null,49346,55707,61757,null,null,null,71943,null,null,null,null,null,null,null,null,null,95397]
[null,null,null,null,null,null,null,null,null,null,null,null,null,null,null,49350,55708,61759,null,null,null,71944,null,null,null,null,null,null,null,null,null,95398]
[null,null,null,null,null,null,null,null,null,null,null,null,null,null,null,49356,55709,61760,null,null,null,71945,null,null,null,null,null,null,null,null,null,95399]
[null,null,null,null,null,null,null,null,null,null,null,null,null,null,null,49358,55710,61763,null,null,null,71946,null,null,null,null,null,null,null,null,null,95400]
[null,null,null,null,null,null,null,null,null,null,null,null,null,null,null,49360,55712,61764,null,null,null,71947,null,null,null,null,null,null,null,null,null,95412]
[null,null,null,null,null,null,null,null,null,null,null,null,null,null,null,49369,55713,61765,null,null,null,71950,null,null,null,null,null,null,null,null,null,95413]
[null,null,null,null,null,null,null,null,null,null,null,null,null,null,null,49370,55714,61766,null,null,null,71953,null,null,null,null,null,null,null,null,null,95414]
[null,null,null,null,null,null,null,null,null,null,null,null,null,null,null,49375,55715,61769,null,null,null,71960,null,null,null,null,null,null,null,null,null,95415]
[null,null,null,null,null,null,null,null,null,null,null,null,null,null,null,49380,55716,61770,null,null,null,71963,null,null,null,null,null,null,null,null,null,95420]
[null,null,null,null,null,null,null,null,null,null,null,null,null,null,null,49388,55717,61773,null,null,null,71964,null,null,null,null,null,null,null,null,null,95422]
[null,null,null,null,null,null,null,null,null,null,null,null,null,null,null,49400,55718,61774,null,null,null,71965,null,null,null,null,null,null,null,null,null,95423]
[null,null,null,null,null,null,null,null,null,null,null,null,null,null,null,49404,55719,61775,null,null,null,71966,null,null,null,null,null,null,null,null,null,95424]
[null,null,null,null,null,null,null,null,null,null,null,null,null,null,null,49410,55720,61776,null,null,null,71967,null,null,null,null,null,null,null,null,null,95425]
[null,null,null,null,null,null,null,null,null,null,null,null,null,null,null,49420,55726,61780,null,null,null,71970,null,null,null,null,null,null,null,null,null,95426]
[null,null,null,null,null,null,null,null,null,null,null,null,null,null,null,49421,55728,61783,null,null,null,71971,null,null,null,null,null,null,null,null,null,95427]
[null,null,null,null,null,null,null,null,null,null,null,null,null,null,null,49423,55729,61784,null,null,null,71973,null,null,null,null,null,null,null,null,null,95429]
[null,null,null,null,null,null,null,null,null,null,null,null,null,null,null,49427,55730,61785,null,null,null,71974,null,null,null,null,null,null,null,null,null,95430]
[null,null,null,null,null,null,null,null,null,null,null,null,null,null,null,49430,55736,61786,null,null,null,71980,null,null,null,null,null,null,null,null,null,95432]
[null,null,null,null,null,null,null,null,null,null,null,null,null,null,null,49432,55737,61787,null,null,null,71982,null,null,null,null,null,null,null,null,null,95435]
[null,null,null,null,null,null,null,null,null,null,null,null,null,null,null,49439,55738,61790,null,null,null,71983,null,null,null,null,null,null,null,null,null,95437]
[null,null,null,null,null,null,null,null,null,null,null,null,null,null,null,49440,55739,61793,null,null,null,71984,null,null,null,null,null,null,null,null,null,95440]
[null,null,null,null,null,null,null,null,null,null,null,null,null,null,null,49446,55740,61794,null,null,null,71985,null,null,null,null,null,null,null,null,null,95443]
[null,null,null,null,null,null,null,null,null,null,null,null,null,null,null,49450,55743,61795,null,null,null,71989,null,null,null,null,null,null,null,null,null,95445]
[null,null,null,null,null,null,null,null,null,null,null,null,null,null,null,49460,55744,61796,null,null,null,71990,null,null,null,null,null,null,null,null,null,95447]
[null,null,null,null,null,null,null,null,null,null,null,null,null,null,null,49462,55745,61797,null,null,null,71992,null,null,null,null,null,null,null,null,null,95450]
[null,null,null,null,null,null,null,null,null,null,null,null,null,null,null,49463,55746,61800,null,null,null,71993,null,null,null,null,null,null,null,null,null,95454]
[null,null,null,null,null,null,null,null,null,null,null,null,null,null,null,49470,55747,61803,null,null,null,71994,null,null,null,null,null,null,null,null,null,95456]
[null,null,null,null,null,null,null,null,null,null,null,null,null,null,null,49490,55748,61804,null,null,null,71996,null,null,null,null,null,null,null,null,null,95458]
[null,null,null,null,null,null,null,null,null,null,null,null,null,null,null,49500,55749,61805,null,null,null,71997,null,null,null,null,null,null,null,null,null,95460]
[null,null,null,null,null,null,null,null,null,null,null,null,null,null,null,49510,55750,61806,null,null,null,71998,null,null,null,null,null,null,null,null,null,95462]
[null,null,null,null,null,null,null,null,null,null,null,null,null,null,null,49514,55752,61807,null,null,null,null,null,null,null,null,null,null,null,null,null,95463]
[null,null,null,null,null,null,null,null,null,null,null,null,null,null,null,49515,55754,61810,null,null,null,null,null,null,null,null,null,null,null,null,null,95464]
[null,null,null,null,null,null,null,null,null,null,null,null,null,null,null,49516,55755,61812,null,null,null,null,null,null,null,null,null,null,null,null,null,95465]
[null,null,null,null,null,null,null,null,null,null,null,null,null,null,null,49530,55757,61813,null,null,null,null,null,null,null,null,null,null,null,null,null,95466]
[null,null,null,null,null,null,null,null,null,null,null,null,null,null,null,49532,55758,61815,null,null,null,null,null,null,null,null,null,null,null,null,null,95467]
[null,null,null,null,null,null,null,null,null,null,null,null,null,null,null,49537,55760,61816,null,null,null,null,null,null,null,null,null,null,null,null,null,95468]
[null,null,null,null,null,null,null,null,null,null,null,null,null,null,null,49540,55763,61817,null,null,null,null,null,null,null,null,null,null,null,null,null,95469]
[null,null,null,null,null,null,null,null,null,null,null,null,null,null,null,49542,55764,61820,null,null,null,null,null,null,null,null,null,null,null,null,null,95470]
[null,null,null,null,null,null,null,null,null,null,null,null,null,null,null,49544,55765,61823,null,null,null,null,null,null,null,null,null,null,null,null,null,95472]
[null,null,null,null,null,null,null,null,null,null,null,null,null,null,null,49547,55766,61824,null,null,null,null,null,null,null,null,null,null,null,null,null,95473]
[null,null,null,null,null,null,null,null,null,null,null,null,null,null,null,49548,55767,61825,null,null,null,null,null,null,null,null,null,null,null,null,null,95474]
[null,null,null,null,null,null,null,null,null,null,null,null,null,null,null,49550,55768,61827,null,null,null,null,null,null,null,null,null,null,null,null,null,95475]
[null,null,null,null,null,null,null,null,null,null,null,null,null,null,null,49570,55769,61830,null,null,null,null,null,null,null,null,null,null,null,null,null,95476]
[null,null,null,null,null,null,null,null,null,null,null,null,null,null,null,49572,55770,61833,null,null,null,null,null,null,null,null,null,null,null,null,null,95477]
[null,null,null,null,null,null,null,null,null,null,null,null,null,null,null,49574,55773,61834,null,null,null,null,null,null,null,null,null,null,null,null,null,95478]
[null,null,null,null,null,null,null,null,null,null,null,null,null,null,null,49575,55776,61835,null,null,null,null,null,null,null,null,null,null,null,null,null,95479]
[null,null,null,null,null,null,null,null,null,null,null,null,null,null,null,49576,55778,61836,null,null,null,null,null,null,null,null,null,null,null,null,null,95480]
[null,null,null,null,null,null,null,null,null,null,null,null,null,null,null,49578,55780,61837,null,null,null,null,null,null,null,null,null,null,null,null,null,95484]
[null,null,null,null,null,null,null,null,null,null,null,null,null,null,null,49580,55783,61838,null,null,null,null,null,null,null,null,null,null,null,null,null,95485]
[null,null,null,null,null,null,null,null,null,null,null,null,null,null,null,49583,55784,61839,null,null,null,null,null,null,null,null,null,null,null,null,null,95486]
[null,null,null,null,null,null,null,null,null,null,null,null,null,null,null,49584,55785,61840,null,null,null,null,null,null,null,null,null,null,null,null,null,95487]
[null,null,null,null,null,null,null,null,null,null,null,null,null,null,null,49585,55786,61844,null,null,null,null,null,null,null,null,null,null,null,null,null,95490]
[null,null,null,null,null,null,null,null,null,null,null,null,null,null,null,49586,55787,61845,null,null,null,null,null,null,null,null,null,null,null,null,null,95494]
[null,null,null,null,null,null,null,null,null,null,null,null,null,null,null,49590,55790,61846,null,null,null,null,null,null,null,null,null,null,null,null,null,95495]
[null,null,null,null,null,null,null,null,null,null,null,null,null,null,null,49595,55793,61847,null,null,null,null,null,null,null,null,null,null,null,null,null,95496]
[null,null,null,null,null,null,null,null,null,null,null,null,null,null,null,49597,55794,61848,null,null,null,null,null,null,null,null,null,null,null,null,null,95497]
[null,null,null,null,null,null,null,null,null,null,null,null,null,null,null,49598,55795,61849,null,null,null,null,null,null,null,null,null,null,null,null,null,95500]
[null,null,null,null,null,null,null,null,null,null,null,null,null,null,null,49600,55796,61850,null,null,null,null,null,null,null,null,null,null,null,null,null,95507]
[null,null,null,null,null,null,null,null,null,null,null,null,null,null,null,49602,55797,61852,null,null,null,null,null,null,null,null,null,null,null,null,null,95508]
[null,null,null,null,null,null,null,null,null,null,null,null,null,null,null,49603,55799,61854,null,null,null,null,null,null,null,null,null,null,null,null,null,95520]
[null,null,null,null,null,null,null,null,null,null,null,null,null,null,null,49604,55800,61855,null,null,null,null,null,null,null,null,null,null,null,null,null,95525]
[null,null,null,null,null,null,null,null,null,null,null,null,null,null,null,49605,55803,61856,null,null,null,null,null,null,null,null,null,null,null,null,null,95526]
[null,null,null,null,null,null,null,null,null,null,null,null,null,null,null,49606,55804,61857,null,null,null,null,null,null,null,null,null,null,null,null,null,95530]
[null,null,null,null,null,null,null,null,null,null,null,null,null,null,null,49607,55805,61858,null,null,null,null,null,null,null,null,null,null,null,null,null,95533]
[null,null,null,null,null,null,null,null,null,null,null,null,null,null,null,49608,55806,61860,null,null,null,null,null,null,null,null,null,null,null,null,null,95540]
[null,null,null,null,null,null,null,null,null,null,null,null,null,null,null,49610,55807,61863,null,null,null,null,null,null,null,null,null,null,null,null,null,95560]
[null,null,null,null,null,null,null,null,null,null,null,null,null,null,null,49615,55810,61864,null,null,null,null,null,null,null,null,null,null,null,null,null,95563]
[null,null,null,null,null,null,null,null,null,null,null,null,null,null,null,49620,55816,61865,null,null,null,null,null,null,null,null,null,null,null,null,null,95570]
[null,null,null,null,null,null,null,null,null,null,null,null,null,null,null,49623,55817,61866,null,null,null,null,null,null,null,null,null,null,null,null,null,95574]
[null,null,null,null,null,null,null,null,null,null,null,null,null,null,null,49624,55820,61868,null,null,null,null,null,null,null,null,null,null,null,null,null,95575]
[null,null,null,null,null,null,null,null,null,null,null,null,null,null,null,49635,55823,61870,null,null,null,null,null,null,null,null,null,null,null,null,null,95576]
[null,null,null,null,null,null,null,null,null,null,null,null,null,null,null,49638,55824,61873,null,null,null,null,null,null,null,null,null,null,null,null,null,95580]
[null,null,null,null,null,null,null,null,null,null,null,null,null,null,null,49639,55825,61874,null,null,null,null,null,null,null,null,null,null,null,null,null,95584]
[null,null,null,null,null,null,null,null,null,null,null,null,null,null,null,49640,55826,61875,null,null,null,null,null,null,null,null,null,null,null,null,null,95585]
[null,null,null,null,null,null,null,null,null,null,null,null,null,null,null,49642,55829,61877,null,null,null,null,null,null,null,null,null,null,null,null,null,95587]
[null,null,null,null,null,null,null,null,null,null,null,null,null,null,null,49647,55830,61878,null,null,null,null,null,null,null,null,null,null,null,null,null,95588]
[null,null,null,null,null,null,null,null,null,null,null,null,null,null,null,49650,55833,61880,null,null,null,null,null,null,null,null,null,null,null,null,null,95590]
[null,null,null,null,null,null,null,null,null,null,null,null,null,null,null,49652,55834,61883,null,null,null,null,null,null,null,null,null,null,null,null,null,95593]
[null,null,null,null,null,null,null,null,null,null,null,null,null,null,null,49653,55835,61884,null,null,null,null,null,null,null,null,null,null,null,null,null,95594]
[null,null,null,null,null,null,null,null,null,null,null,null,null,null,null,49654,55836,61885,null,null,null,null,null,null,null,null,null,null,null,null,null,95595]
[null,null,null,null,null,null,null,null,null,null,null,null,null,null,null,49655,55837,61886,null,null,null,null,null,null,null,null,null,null,null,null,null,95597]
[null,null,null,null,null,null,null,null,null,null,null,null,null,null,null,49656,55838,61887,null,null,null,null,null,null,null,null,null,null,null,null,null,95598]
[null,null,null,null,null,null,null,null,null,null,null,null,null,null,null,49657,55840,61890,null,null,null,null,null,null,null,null,null,null,null,null,null,95600]
[null,null,null,null,null,null,null,null,null,null,null,null,null,null,null,49658,55843,61892,null,null,null,null,null,null,null,null,null,null,null,null,null,95603]
[null,null,null,null,null,null,null,null,null,null,null,null,null,null,null,49659,55844,61893,null,null,null,null,null,null,null,null,null,null,null,null,null,95604]
[null,null,null,null,null,null,null,null,null,null,null,null,null,null,null,49660,55845,61894,null,null,null,null,null,null,null,null,null,null,null,null,null,95605]
[null,null,null,null,null,null,null,null,null,null,null,null,null,null,null,49663,55846,61895,null,null,null,null,null,null,null,null,null,null,null,null,null,95606]
[null,null,null,null,null,null,null,null,null,null,null,null,null,null,null,49664,55847,61896,null,null,null,null,null,null,null,null,null,null,null,null,null,95607]
[null,null,null,null,null,null,null,null,null,null,null,null,null,null,null,49665,55850,61899,null,null,null,null,null,null,null,null,null,null,null,null,null,95609]
[null,null,null,null,null,null,null,null,null,null,null,null,null,null,null,49667,55852,61900,null,null,null,null,null,null,null,null,null,null,null,null,null,95614]
[null,null,null,null,null,null,null,null,null,null,null,null,null,null,null,49670,55853,61903,null,null,null,null,null,null,null,null,null,null,null,null,null,95618]
[null,null,null,null,null,null,null,null,null,null,null,null,null,null,null,49675,55854,61904,null,null,null,null,null,null,null,null,null,null,null,null,null,95619]
[null,null,null,null,null,null,null,null,null,null,null,null,null,null,null,49676,55855,61905,null,null,null,null,null,null,null,null,null,null,null,null,null,95620]
[null,null,null,null,null,null,null,null,null,null,null,null,null,null,null,49677,55856,61907,null,null,null,null,null,null,null,null,null,null,null,null,null,95623]
[null,null,null,null,null,null,null,null,null,null,null,null,null,null,null,49678,55859,61908,null,null,null,null,null,null,null,null,null,null,null,null,null,95624]
[null,null,null,null,null,null,null,null,null,null,null,null,null,null,null,49680,55870,61909,null,null,null,null,null,null,null,null,null,null,null,null,null,95625]
[null,null,null,null,null,null,null,null,null,null,null,null,null,null,null,49685,55873,61910,null,null,null,null,null,null,null,null,null,null,null,null,null,95627]
[null,null,null,null,null,null,null,null,null,null,null,null,null,null,null,49687,55874,61911,null,null,null,null,null,null,null,null,null,null,null,null,null,95628]
[null,null,null,null,null,null,null,null,null,null,null,null,null,null,null,49690,55875,61913,null,null,null,null,null,null,null,null,null,null,null,null,null,95629]
[null,null,null,null,null,null,null,null,null,null,null,null,null,null,null,49700,55877,61914,null,null,null,null,null,null,null,null,null,null,null,null,null,95630]
[null,null,null,null,null,null,null,null,null,null,null,null,null,null,null,49705,55878,61915,null,null,null,null,null,null,null,null,null,null,null,null,null,95634]
[null,null,null,null,null,null,null,null,null,null,null,null,null,null,null,49710,55880,61916,null,null,null,null,null,null,null,null,null,null,null,null,null,95635]
[null,null,null,null,null,null,null,null,null,null,null,null,null,null,null,49714,55882,61917,null,null,null,null,null,null,null,null,null,null,null,null,null,95636]
[null,null,null,null,null,null,null,null,null,null,null,null,null,null,null,49720,55883,61918,null,null,null,null,null,null,null,null,null,null,null,null,null,95637]
[null,null,null,null,null,null,null,null,null,null,null,null,null,null,null,49728,55884,61920,null,null,null,null,null,null,null,null,null,null,null,null,null,95640]
[null,null,null,null,null,null,null,null,null,null,null,null,null,null,null,49730,55885,61923,null,null,null,null,null,null,null,null,null,null,null,null,null,95642]
[null,null,null,null,null,null,null,null,null,null,null,null,null,null,null,49735,55886,61924,null,null,null,null,null,null,null,null,null,null,null,null,null,95643]
[null,null,null,null,null,null,null,null,null,null,null,null,null,null,null,49738,55887,61925,null,null,null,null,null,null,null,null,null,null,null,null,null,95645]
[null,null,null,null,null,null,null,null,null,null,null,null,null,null,null,49740,55888,61926,null,null,null,null,null,null,null,null,null,null,null,null,null,95646]
[null,null,null,null,null,null,null,null,null,null,null,null,null,null,null,49744,55890,61927,null,null,null,null,null,null,null,null,null,null,null,null,null,95647]
[null,null,null,null,null,null,null,null,null,null,null,null,null,null,null,49750,55893,61928,null,null,null,null,null,null,null,null,null,null,null,null,null,95648]
[null,null,null,null,null,null,null,null,null,null,null,null,null,null,null,49754,55894,61929,null,null,null,null,null,null,null,null,null,null,null,null,null,95650]
[null,null,null,null,null,null,null,null,null,null,null,null,null,null,null,49755,55895,61930,null,null,null,null,null,null,null,null,null,null,null,null,null,95652]
[null,null,null,null,null,null,null,null,null,null,null,null,null,null,null,49756,55896,61933,null,null,null,null,null,null,null,null,null,null,null,null,null,95653]
[null,null,null,null,null,null,null,null,null,null,null,null,null,null,null,49757,55899,61934,null,null,null,null,null,null,null,null,null,null,null,null,null,95654]
[null,null,null,null,null,null,null,null,null,null,null,null,null,null,null,49758,55900,61935,null,null,null,null,null,null,null,null,null,null,null,null,null,95655]
[null,null,null,null,null,null,null,null,null,null,null,null,null,null,null,49759,55913,61936,null,null,null,null,null,null,null,null,null,null,null,null,null,95657]
[null,null,null,null,null,null,null,null,null,null,null,null,null,null,null,49760,55914,61937,null,null,null,null,null,null,null,null,null,null,null,null,null,95658]
[null,null,null,null,null,null,null,null,null,null,null,null,null,null,null,49764,55920,61938,null,null,null,null,null,null,null,null,null,null,null,null,null,95659]
[null,null,null,null,null,null,null,null,null,null,null,null,null,null,null,49765,55923,61940,null,null,null,null,null,null,null,null,null,null,null,null,null,95670]
[null,null,null,null,null,null,null,null,null,null,null,null,null,null,null,49767,55924,61942,null,null,null,null,null,null,null,null,null,null,null,null,null,95672]
[null,null,null,null,null,null,null,null,null,null,null,null,null,null,null,49769,55925,61943,null,null,null,null,null,null,null,null,null,null,null,null,null,95673]
[null,null,null,null,null,null,null,null,null,null,null,null,null,null,null,49770,55926,61944,null,null,null,null,null,null,null,null,null,null,null,null,null,95674]
[null,null,null,null,null,null,null,null,null,null,null,null,null,null,null,49775,55927,61945,null,null,null,null,null,null,null,null,null,null,null,null,null,95675]
[null,null,null,null,null,null,null,null,null,null,null,null,null,null,null,49779,55930,61946,null,null,null,null,null,null,null,null,null,null,null,null,null,95676]
[null,null,null,null,null,null,null,null,null,null,null,null,null,null,null,49780,55934,61947,null,null,null,null,null,null,null,null,null,null,null,null,null,95677]
[null,null,null,null,null,null,null,null,null,null,null,null,null,null,null,49783,55935,61948,null,null,null,null,null,null,null,null,null,null,null,null,null,95679]
[null,null,null,null,null,null,null,null,null,null,null,null,null,null,null,49784,55936,61950,null,null,null,null,null,null,null,null,null,null,null,null,null,95680]
[null,null,null,null,null,null,null,null,null,null,null,null,null,null,null,49786,55937,61952,null,null,null,null,null,null,null,null,null,null,null,null,null,95682]
[null,null,null,null,null,null,null,null,null,null,null,null,null,null,null,49789,55940,61954,null,null,null,null,null,null,null,null,null,null,null,null,null,95683]
[null,null,null,null,null,null,null,null,null,null,null,null,null,null,null,49800,55943,61955,null,null,null,null,null,null,null,null,null,null,null,null,null,95684]
[null,null,null,null,null,null,null,null,null,null,null,null,null,null,null,49805,55950,61956,null,null,null,null,null,null,null,null,null,null,null,null,null,95685]
[null,null,null,null,null,null,null,null,null,null,null,null,null,null,null,49806,55952,61957,null,null,null,null,null,null,null,null,null,null,null,null,null,95686]
[null,null,null,null,null,null,null,null,null,null,null,null,null,null,null,49807,55954,61958,null,null,null,null,null,null,null,null,null,null,null,null,null,95687]
[null,null,null,null,null,null,null,null,null,null,null,null,null,null,null,49808,55955,61959,null,null,null,null,null,null,null,null,null,null,null,null,null,95689]
[null,null,null,null,null,null,null,null,null,null,null,null,null,null,null,49810,55956,61960,null,null,null,null,null,null,null,null,null,null,null,null,null,95690]
[null,null,null,null,null,null,null,null,null,null,null,null,null,null,null,49815,55960,61963,null,null,null,null,null,null,null,null,null,null,null,null,null,95693]
[null,null,null,null,null,null,null,null,null,null,null,null,null,null,null,49816,55963,61964,null,null,null,null,null,null,null,null,null,null,null,null,null,95694]
[null,null,null,null,null,null,null,null,null,null,null,null,null,null,null,49817,55965,61965,null,null,null,null,null,null,null,null,null,null,null,null,null,95695]
[null,null,null,null,null,null,null,null,null,null,null,null,null,null,null,49820,55966,61966,null,null,null,null,null,null,null,null,null,null,null,null,null,95696]
[null,null,null,null,null,null,null,null,null,null,null,null,null,null,null,49825,55970,61967,null,null,null,null,null,null,null,null,null,null,null,null,null,95697]
[null,null,null,null,null,null,null,null,null,null,null,null,null,null,null,49828,55973,61969,null,null,null,null,null,null,null,null,null,null,null,null,null,95700]
[null,null,null,null,null,null,null,null,null,null,null,null,null,null,null,49829,55975,61970,null,null,null,null,null,null,null,null,null,null,null,null,null,95710]
[null,null,null,null,null,null,null,null,null,null,null,null,null,null,null,49830,55976,61971,null,null,null,null,null,null,null,null,null,null,null,null,null,95714]
[null,null,null,null,null,null,null,null,null,null,null,null,null,null,null,49834,55977,61972,null,null,null,null,null,null,null,null,null,null,null,null,null,95716]
[null,null,null,null,null,null,null,null,null,null,null,null,null,null,null,49835,55978,61973,null,null,null,null,null,null,null,null,null,null,null,null,null,95717]
[null,null,null,null,null,null,null,null,null,null,null,null,null,null,null,49836,55980,61974,null,null,null,null,null,null,null,null,null,null,null,null,null,95718]
[null,null,null,null,null,null,null,null,null,null,null,null,null,null,null,49837,55983,61975,null,null,null,null,null,null,null,null,null,null,null,null,null,95720]
[null,null,null,null,null,null,null,null,null,null,null,null,null,null,null,49840,55984,61976,null,null,null,null,null,null,null,null,null,null,null,null,null,95725]
[null,null,null,null,null,null,null,null,null,null,null,null,null,null,null,49848,55985,61978,null,null,null,null,null,null,null,null,null,null,null,null,null,95726]
[null,null,null,null,null,null,null,null,null,null,null,null,null,null,null,49850,55988,61979,null,null,null,null,null,null,null,null,null,null,null,null,null,95729]
[null,null,null,null,null,null,null,null,null,null,null,null,null,null,null,49860,55989,61980,null,null,null,null,null,null,null,null,null,null,null,null,null,95730]
[null,null,null,null,null,null,null,null,null,null,null,null,null,null,null,49867,55990,61984,null,null,null,null,null,null,null,null,null,null,null,null,null,95736]
[null,null,null,null,null,null,null,null,null,null,null,null,null,null,null,49869,55993,61985,null,null,null,null,null,null,null,null,null,null,null,null,null,95739]
[null,null,null,null,null,null,null,null,null,null,null,null,null,null,null,49870,55994,61986,null,null,null,null,null,null,null,null,null,null,null,null,null,95740]
[null,null,null,null,null,null,null,null,null,null,null,null,null,null,null,49873,55995,61987,null,null,null,null,null,null,null,null,null,null,null,null,null,95746]
[null,null,null,null,null,null,null,null,null,null,null,null,null,null,null,49874,55996,61990,null,null,null,null,null,null,null,null,null,null,null,null,null,95748]
[null,null,null,null,null,null,null,null,null,null,null,null,null,null,null,49875,55997,61991,null,null,null,null,null,null,null,null,null,null,null,null,null,95749]
[null,null,null,null,null,null,null,null,null,null,null,null,null,null,null,49876,55998,61992,null,null,null,null,null,null,null,null,null,null,null,null,null,95750]
[null,null,null,null,null,null,null,null,null,null,null,null,null,null,null,49877,56000,61993,null,null,null,null,null,null,null,null,null,null,null,null,null,95756]
[null,null,null,null,null,null,null,null,null,null,null,null,null,null,null,49883,56003,61994,null,null,null,null,null,null,null,null,null,null,null,null,null,95760]
[null,null,null,null,null,null,null,null,null,null,null,null,null,null,null,49885,56004,61995,null,null,null,null,null,null,null,null,null,null,null,null,null,95763]
[null,null,null,null,null,null,null,null,null,null,null,null,null,null,null,49886,56005,61996,null,null,null,null,null,null,null,null,null,null,null,null,null,95765]
[null,null,null,null,null,null,null,null,null,null,null,null,null,null,null,49887,56006,61997,null,null,null,null,null,null,null,null,null,null,null,null,null,95770]
[null,null,null,null,null,null,null,null,null,null,null,null,null,null,null,49893,56007,61998,null,null,null,null,null,null,null,null,null,null,null,null,null,95775]
[null,null,null,null,null,null,null,null,null,null,null,null,null,null,null,49894,56010,null,null,null,null,null,null,null,null,null,null,null,null,null,null,95778]
[null,null,null,null,null,null,null,null,null,null,null,null,null,null,null,49895,56020,null,null,null,null,null,null,null,null,null,null,null,null,null,null,95780]
[null,null,null,null,null,null,null,null,null,null,null,null,null,null,null,49896,56023,null,null,null,null,null,null,null,null,null,null,null,null,null,null,95786]
[null,null,null,null,null,null,null,null,null,null,null,null,null,null,null,49897,56024,null,null,null,null,null,null,null,null,null,null,null,null,null,null,95790]
[null,null,null,null,null,null,null,null,null,null,null,null,null,null,null,49900,56030,null,null,null,null,null,null,null,null,null,null,null,null,null,null,95795]
[null,null,null,null,null,null,null,null,null,null,null,null,null,null,null,49902,56033,null,null,null,null,null,null,null,null,null,null,null,null,null,null,95797]
[null,null,null,null,null,null,null,null,null,null,null,null,null,null,null,49903,56034,null,null,null,null,null,null,null,null,null,null,null,null,null,null,95800]
[null,null,null,null,null,null,null,null,null,null,null,null,null,null,null,49904,56035,null,null,null,null,null,null,null,null,null,null,null,null,null,null,95801]
[null,null,null,null,null,null,null,null,null,null,null,null,null,null,null,49910,56036,null,null,null,null,null,null,null,null,null,null,null,null,null,null,95802]
[null,null,null,null,null,null,null,null,null,null,null,null,null,null,null,49920,56037,null,null,null,null,null,null,null,null,null,null,null,null,null,null,95803]
[null,null,null,null,null,null,null,null,null,null,null,null,null,null,null,49924,56038,null,null,null,null,null,null,null,null,null,null,null,null,null,null,95804]
[null,null,null,null,null,null,null,null,null,null,null,null,null,null,null,49925,56040,null,null,null,null,null,null,null,null,null,null,null,null,null,null,95805]
[null,null,null,null,null,null,null,null,null,null,null,null,null,null,null,49940,56050,null,null,null,null,null,null,null,null,null,null,null,null,null,null,95806]
[null,null,null,null,null,null,null,null,null,null,null,null,null,null,null,49943,56053,null,null,null,null,null,null,null,null,null,null,null,null,null,null,95807]
[null,null,null,null,null,null,null,null,null,null,null,null,null,null,null,49950,56054,null,null,null,null,null,null,null,null,null,null,null,null,null,null,95809]
[null,null,null,null,null,null,null,null,null,null,null,null,null,null,null,49952,56055,null,null,null,null,null,null,null,null,null,null,null,null,null,null,95810]
[null,null,null,null,null,null,null,null,null,null,null,null,null,null,null,49953,56056,null,null,null,null,null,null,null,null,null,null,null,null,null,null,95812]
[null,null,null,null,null,null,null,null,null,null,null,null,null,null,null,49955,56057,null,null,null,null,null,null,null,null,null,null,null,null,null,null,95813]
[null,null,null,null,null,null,null,null,null,null,null,null,null,null,null,49956,56070,null,null,null,null,null,null,null,null,null,null,null,null,null,null,95814]
[null,null,null,null,null,null,null,null,null,null,null,null,null,null,null,49957,56074,null,null,null,null,null,null,null,null,null,null,null,null,null,null,95815]
[null,null,null,null,null,null,null,null,null,null,null,null,null,null,null,49959,56075,null,null,null,null,null,null,null,null,null,null,null,null,null,null,95816]
[null,null,null,null,null,null,null,null,null,null,null,null,null,null,null,49960,56077,null,null,null,null,null,null,null,null,null,null,null,null,null,null,95817]
[null,null,null,null,null,null,null,null,null,null,null,null,null,null,null,49963,56078,null,null,null,null,null,null,null,null,null,null,null,null,null,null,95818]
[null,null,null,null,null,null,null,null,null,null,null,null,null,null,null,49968,56080,null,null,null,null,null,null,null,null,null,null,null,null,null,null,95819]
[null,null,null,null,null,null,null,null,null,null,null,null,null,null,null,49970,56085,null,null,null,null,null,null,null,null,null,null,null,null,null,null,95820]
[null,null,null,null,null,null,null,null,null,null,null,null,null,null,null,49977,56086,null,null,null,null,null,null,null,null,null,null,null,null,null,null,95821]
[null,null,null,null,null,null,null,null,null,null,null,null,null,null,null,49979,56087,null,null,null,null,null,null,null,null,null,null,null,null,null,null,95823]
[null,null,null,null,null,null,null,null,null,null,null,null,null,null,null,49990,56100,null,null,null,null,null,null,null,null,null,null,null,null,null,null,95824]
[null,null,null,null,null,null,null,null,null,null,null,null,null,null,null,49994,56105,null,null,null,null,null,null,null,null,null,null,null,null,null,null,95825]
[null,null,null,null,null,null,null,null,null,null,null,null,null,null,null,49996,56106,null,null,null,null,null,null,null,null,null,null,null,null,null,null,95826]
[null,null,null,null,null,null,null,null,null,null,null,null,null,null,null,null,56110,null,null,null,null,null,null,null,null,null,null,null,null,null,null,95827]
[null,null,null,null,null,null,null,null,null,null,null,null,null,null,null,null,56120,null,null,null,null,null,null,null,null,null,null,null,null,null,null,95830]
[null,null,null,null,null,null,null,null,null,null,null,null,null,null,null,null,56130,null,null,null,null,null,null,null,null,null,null,null,null,null,null,95832]
[null,null,null,null,null,null,null,null,null,null,null,null,null,null,null,null,56140,null,null,null,null,null,null,null,null,null,null,null,null,null,null,95833]
[null,null,null,null,null,null,null,null,null,null,null,null,null,null,null,null,56150,null,null,null,null,null,null,null,null,null,null,null,null,null,null,95834]
[null,null,null,null,null,null,null,null,null,null,null,null,null,null,null,null,56160,null,null,null,null,null,null,null,null,null,null,null,null,null,null,95835]
[null,null,null,null,null,null,null,null,null,null,null,null,null,null,null,null,56170,null,null,null,null,null,null,null,null,null,null,null,null,null,null,95836]
[null,null,null,null,null,null,null,null,null,null,null,null,null,null,null,null,56200,null,null,null,null,null,null,null,null,null,null,null,null,null,null,95837]
[null,null,null,null,null,null,null,null,null,null,null,null,null,null,null,null,56203,null,null,null,null,null,null,null,null,null,null,null,null,null,null,95838]
[null,null,null,null,null,null,null,null,null,null,null,null,null,null,null,null,56204,null,null,null,null,null,null,null,null,null,null,null,null,null,null,95839]
[null,null,null,null,null,null,null,null,null,null,null,null,null,null,null,null,56205,null,null,null,null,null,null,null,null,null,null,null,null,null,null,95840]
[null,null,null,null,null,null,null,null,null,null,null,null,null,null,null,null,56207,null,null,null,null,null,null,null,null,null,null,null,null,null,null,95842]
[null,null,null,null,null,null,null,null,null,null,null,null,null,null,null,null,56208,null,null,null,null,null,null,null,null,null,null,null,null,null,null,95843]
[null,null,null,null,null,null,null,null,null,null,null,null,null,null,null,null,56210,null,null,null,null,null,null,null,null,null,null,null,null,null,null,95844]
[null,null,null,null,null,null,null,null,null,null,null,null,null,null,null,null,56213,null,null,null,null,null,null,null,null,null,null,null,null,null,null,95845]
[null,null,null,null,null,null,null,null,null,null,null,null,null,null,null,null,56214,null,null,null,null,null,null,null,null,null,null,null,null,null,null,95846]
[null,null,null,null,null,null,null,null,null,null,null,null,null,null,null,null,56215,null,null,null,null,null,null,null,null,null,null,null,null,null,null,95847]
[null,null,null,null,null,null,null,null,null,null,null,null,null,null,null,null,56216,null,null,null,null,null,null,null,null,null,null,null,null,null,null,95848]
[null,null,null,null,null,null,null,null,null,null,null,null,null,null,null,null,56217,null,null,null,null,null,null,null,null,null,null,null,null,null,null,95850]
[null,null,null,null,null,null,null,null,null,null,null,null,null,null,null,null,56220,null,null,null,null,null,null,null,null,null,null,null,null,null,null,95853]
[null,null,null,null,null,null,null,null,null,null,null,null,null,null,null,null,56223,null,null,null,null,null,null,null,null,null,null,null,null,null,null,95854]
[null,null,null,null,null,null,null,null,null,null,null,null,null,null,null,null,56224,null,null,null,null,null,null,null,null,null,null,null,null,null,null,95855]
[null,null,null,null,null,null,null,null,null,null,null,null,null,null,null,null,56225,null,null,null,null,null,null,null,null,null,null,null,null,null,null,95856]
[null,null,null,null,null,null,null,null,null,null,null,null,null,null,null,null,56226,null,null,null,null,null,null,null,null,null,null,null,null,null,null,95857]
[null,null,null,null,null,null,null,null,null,null,null,null,null,null,null,null,56227,null,null,null,null,null,null,null,null,null,null,null,null,null,null,95858]
[null,null,null,null,null,null,null,null,null,null,null,null,null,null,null,null,56230,null,null,null,null,null,null,null,null,null,null,null,null,null,null,95862]
[null,null,null,null,null,null,null,null,null,null,null,null,null,null,null,null,56233,null,null,null,null,null,null,null,null,null,null,null,null,null,null,95863]
[null,null,null,null,null,null,null,null,null,null,null,null,null,null,null,null,56235,null,null,null,null,null,null,null,null,null,null,null,null,null,null,95864]
[null,null,null,null,null,null,null,null,null,null,null,null,null,null,null,null,56236,null,null,null,null,null,null,null,null,null,null,null,null,null,null,95865]
[null,null,null,null,null,null,null,null,null,null,null,null,null,null,null,null,56237,null,null,null,null,null,null,null,null,null,null,null,null,null,null,95866]
[null,null,null,null,null,null,null,null,null,null,null,null,null,null,null,null,56240,null,null,null,null,null,null,null,null,null,null,null,null,null,null,95867]
[null,null,null,null,null,null,null,null,null,null,null,null,null,null,null,null,56243,null,null,null,null,null,null,null,null,null,null,null,null,null,null,95868]
[null,null,null,null,null,null,null,null,null,null,null,null,null,null,null,null,56244,null,null,null,null,null,null,null,null,null,null,null,null,null,null,95869]
[null,null,null,null,null,null,null,null,null,null,null,null,null,null,null,null,56245,null,null,null,null,null,null,null,null,null,null,null,null,null,null,95870]
[null,null,null,null,null,null,null,null,null,null,null,null,null,null,null,null,56246,null,null,null,null,null,null,null,null,null,null,null,null,null,null,95873]
[null,null,null,null,null,null,null,null,null,null,null,null,null,null,null,null,56247,null,null,null,null,null,null,null,null,null,null,null,null,null,null,95874]
[null,null,null,null,null,null,null,null,null,null,null,null,null,null,null,null,56250,null,null,null,null,null,null,null,null,null,null,null,null,null,null,95875]
[null,null,null,null,null,null,null,null,null,null,null,null,null,null,null,null,56253,null,null,null,null,null,null,null,null,null,null,null,null,null,null,95876]
[null,null,null,null,null,null,null,null,null,null,null,null,null,null,null,null,56254,null,null,null,null,null,null,null,null,null,null,null,null,null,null,95877]
[null,null,null,null,null,null,null,null,null,null,null,null,null,null,null,null,56255,null,null,null,null,null,null,null,null,null,null,null,null,null,null,95879]
[null,null,null,null,null,null,null,null,null,null,null,null,null,null,null,null,56256,null,null,null,null,null,null,null,null,null,null,null,null,null,null,95880]
[null,null,null,null,null,null,null,null,null,null,null,null,null,null,null,null,56257,null,null,null,null,null,null,null,null,null,null,null,null,null,null,95883]
[null,null,null,null,null,null,null,null,null,null,null,null,null,null,null,null,56260,null,null,null,null,null,null,null,null,null,null,null,null,null,null,95884]
[null,null,null,null,null,null,null,null,null,null,null,null,null,null,null,null,56263,null,null,null,null,null,null,null,null,null,null,null,null,null,null,95888]
[null,null,null,null,null,null,null,null,null,null,null,null,null,null,null,null,56264,null,null,null,null,null,null,null,null,null,null,null,null,null,null,95890]
[null,null,null,null,null,null,null,null,null,null,null,null,null,null,null,null,56265,null,null,null,null,null,null,null,null,null,null,null,null,null,null,95893]
[null,null,null,null,null,null,null,null,null,null,null,null,null,null,null,null,56266,null,null,null,null,null,null,null,null,null,null,null,null,null,null,95894]
[null,null,null,null,null,null,null,null,null,null,null,null,null,null,null,null,56267,null,null,null,null,null,null,null,null,null,null,null,null,null,null,95897]
[null,null,null,null,null,null,null,null,null,null,null,null,null,null,null,null,56268,null,null,null,null,null,null,null,null,null,null,null,null,null,null,95898]
[null,null,null,null,null,null,null,null,null,null,null,null,null,null,null,null,56270,null,null,null,null,null,null,null,null,null,null,null,null,null,null,95900]
[null,null,null,null,null,null,null,null,null,null,null,null,null,null,null,null,56272,null,null,null,null,null,null,null,null,null,null,null,null,null,null,95903]
[null,null,null,null,null,null,null,null,null,null,null,null,null,null,null,null,56273,null,null,null,null,null,null,null,null,null,null,null,null,null,null,95904]
[null,null,null,null,null,null,null,null,null,null,null,null,null,null,null,null,56274,null,null,null,null,null,null,null,null,null,null,null,null,null,null,95905]
[null,null,null,null,null,null,null,null,null,null,null,null,null,null,null,null,56280,null,null,null,null,null,null,null,null,null,null,null,null,null,null,95906]
[null,null,null,null,null,null,null,null,null,null,null,null,null,null,null,null,56300,null,null,null,null,null,null,null,null,null,null,null,null,null,null,95910]
[null,null,null,null,null,null,null,null,null,null,null,null,null,null,null,null,56303,null,null,null,null,null,null,null,null,null,null,null,null,null,null,95912]
[null,null,null,null,null,null,null,null,null,null,null,null,null,null,null,null,56304,null,null,null,null,null,null,null,null,null,null,null,null,null,null,95914]
[null,null,null,null,null,null,null,null,null,null,null,null,null,null,null,null,56305,null,null,null,null,null,null,null,null,null,null,null,null,null,null,95917]
[null,null,null,null,null,null,null,null,null,null,null,null,null,null,null,null,56306,null,null,null,null,null,null,null,null,null,null,null,null,null,null,95920]
[null,null,null,null,null,null,null,null,null,null,null,null,null,null,null,null,56310,null,null,null,null,null,null,null,null,null,null,null,null,null,null,95922]
[null,null,null,null,null,null,null,null,null,null,null,null,null,null,null,null,56314,null,null,null,null,null,null,null,null,null,null,null,null,null,null,95924]
[null,null,null,null,null,null,null,null,null,null,null,null,null,null,null,null,56315,null,null,null,null,null,null,null,null,null,null,null,null,null,null,95925]
[null,null,null,null,null,null,null,null,null,null,null,null,null,null,null,null,56330,null,null,null,null,null,null,null,null,null,null,null,null,null,null,95930]
[null,null,null,null,null,null,null,null,null,null,null,null,null,null,null,null,56334,null,null,null,null,null,null,null,null,null,null,null,null,null,null,95932]
[null,null,null,null,null,null,null,null,null,null,null,null,null,null,null,null,56335,null,null,null,null,null,null,null,null,null,null,null,null,null,null,95933]
[null,null,null,null,null,null,null,null,null,null,null,null,null,null,null,null,56337,null,null,null,null,null,null,null,null,null,null,null,null,null,null,95935]
[null,null,null,null,null,null,null,null,null,null,null,null,null,null,null,null,56338,null,null,null,null,null,null,null,null,null,null,null,null,null,null,95947]
[null,null,null,null,null,null,null,null,null,null,null,null,null,null,null,null,56340,null,null,null,null,null,null,null,null,null,null,null,null,null,null,95948]
[null,null,null,null,null,null,null,null,null,null,null,null,null,null,null,null,56343,null,null,null,null,null,null,null,null,null,null,null,null,null,null,95950]
[null,null,null,null,null,null,null,null,null,null,null,null,null,null,null,null,56344,null,null,null,null,null,null,null,null,null,null,null,null,null,null,95953]
[null,null,null,null,null,null,null,null,null,null,null,null,null,null,null,null,56346,null,null,null,null,null,null,null,null,null,null,null,null,null,null,95954]
[null,null,null,null,null,null,null,null,null,null,null,null,null,null,null,null,56350,null,null,null,null,null,null,null,null,null,null,null,null,null,null,95955]
[null,null,null,null,null,null,null,null,null,null,null,null,null,null,null,null,56353,null,null,null,null,null,null,null,null,null,null,null,null,null,null,95957]
[null,null,null,null,null,null,null,null,null,null,null,null,null,null,null,null,56356,null,null,null,null,null,null,null,null,null,null,null,null,null,null,95959]
[null,null,null,null,null,null,null,null,null,null,null,null,null,null,null,null,56360,null,null,null,null,null,null,null,null,null,null,null,null,null,null,95960]
[null,null,null,null,null,null,null,null,null,null,null,null,null,null,null,null,56363,null,null,null,null,null,null,null,null,null,null,null,null,null,null,95963]
[null,null,null,null,null,null,null,null,null,null,null,null,null,null,null,null,56366,null,null,null,null,null,null,null,null,null,null,null,null,null,null,95965]
[null,null,null,null,null,null,null,null,null,null,null,null,null,null,null,null,56370,null,null,null,null,null,null,null,null,null,null,null,null,null,null,95966]
[null,null,null,null,null,null,null,null,null,null,null,null,null,null,null,null,56373,null,null,null,null,null,null,null,null,null,null,null,null,null,null,95967]
[null,null,null,null,null,null,null,null,null,null,null,null,null,null,null,null,56375,null,null,null,null,null,null,null,null,null,null,null,null,null,null,95969]
[null,null,null,null,null,null,null,null,null,null,null,null,null,null,null,null,56376,null,null,null,null,null,null,null,null,null,null,null,null,null,null,95970]
[null,null,null,null,null,null,null,null,null,null,null,null,null,null,null,null,56377,null,null,null,null,null,null,null,null,null,null,null,null,null,null,95980]
[null,null,null,null,null,null,null,null,null,null,null,null,null,null,null,null,56380,null,null,null,null,null,null,null,null,null,null,null,null,null,null,95986]
[null,null,null,null,null,null,null,null,null,null,null,null,null,null,null,null,56383,null,null,null,null,null,null,null,null,null,null,null,null,null,null,95990]
[null,null,null,null,null,null,null,null,null,null,null,null,null,null,null,null,56384,null,null,null,null,null,null,null,null,null,null,null,null,null,null,95992]
[null,null,null,null,null,null,null,null,null,null,null,null,null,null,null,null,56386,null,null,null,null,null,null,null,null,null,null,null,null,null,null,95993]
[null,null,null,null,null,null,null,null,null,null,null,null,null,null,null,null,56390,null,null,null,null,null,null,null,null,null,null,null,null,null,null,95994]
[null,null,null,null,null,null,null,null,null,null,null,null,null,null,null,null,56395,null,null,null,null,null,null,null,null,null,null,null,null,null,null,95995]
[null,null,null,null,null,null,null,null,null,null,null,null,null,null,null,null,56396,null,null,null,null,null,null,null,null,null,null,null,null,null,null,95997]
[null,null,null,null,null,null,null,null,null,null,null,null,null,null,null,null,56400,null,null,null,null,null,null,null,null,null,null,null,null,null,null,96000]
[null,null,null,null,null,null,null,null,null,null,null,null,null,null,null,null,56410,null,null,null,null,null,null,null,null,null,null,null,null,null,null,96010]
[null,null,null,null,null,null,null,null,null,null,null,null,null,null,null,null,56420,null,null,null,null,null,null,null,null,null,null,null,null,null,null,96014]
[null,null,null,null,null,null,null,null,null,null,null,null,null,null,null,null,56428,null,null,null,null,null,null,null,null,null,null,null,null,null,null,96020]
[null,null,null,null,null,null,null,null,null,null,null,null,null,null,null,null,56429,null,null,null,null,null,null,null,null,null,null,null,null,null,null,96025]
[null,null,null,null,null,null,null,null,null,null,null,null,null,null,null,null,56430,null,null,null,null,null,null,null,null,null,null,null,null,null,null,96026]
[null,null,null,null,null,null,null,null,null,null,null,null,null,null,null,null,56440,null,null,null,null,null,null,null,null,null,null,null,null,null,null,96028]
[null,null,null,null,null,null,null,null,null,null,null,null,null,null,null,null,56490,null,null,null,null,null,null,null,null,null,null,null,null,null,null,96029]
[null,null,null,null,null,null,null,null,null,null,null,null,null,null,null,null,56495,null,null,null,null,null,null,null,null,null,null,null,null,null,null,96030]
[null,null,null,null,null,null,null,null,null,null,null,null,null,null,null,null,56500,null,null,null,null,null,null,null,null,null,null,null,null,null,null,96039]
[null,null,null,null,null,null,null,null,null,null,null,null,null,null,null,null,56505,null,null,null,null,null,null,null,null,null,null,null,null,null,null,96048]
[null,null,null,null,null,null,null,null,null,null,null,null,null,null,null,null,56507,null,null,null,null,null,null,null,null,null,null,null,null,null,null,96049]
[null,null,null,null,null,null,null,null,null,null,null,null,null,null,null,null,56508,null,null,null,null,null,null,null,null,null,null,null,null,null,null,96050]
[null,null,null,null,null,null,null,null,null,null,null,null,null,null,null,null,56509,null,null,null,null,null,null,null,null,null,null,null,null,null,null,96054]
[null,null,null,null,null,null,null,null,null,null,null,null,null,null,null,null,56510,null,null,null,null,null,null,null,null,null,null,null,null,null,null,96055]
[null,null,null,null,null,null,null,null,null,null,null,null,null,null,null,null,56512,null,null,null,null,null,null,null,null,null,null,null,null,null,null,96056]
[null,null,null,null,null,null,null,null,null,null,null,null,null,null,null,null,56513,null,null,null,null,null,null,null,null,null,null,null,null,null,null,96057]
[null,null,null,null,null,null,null,null,null,null,null,null,null,null,null,null,56514,null,null,null,null,null,null,null,null,null,null,null,null,null,null,96067]
[null,null,null,null,null,null,null,null,null,null,null,null,null,null,null,null,56515,null,null,null,null,null,null,null,null,null,null,null,null,null,null,96068]
[null,null,null,null,null,null,null,null,null,null,null,null,null,null,null,null,56516,null,null,null,null,null,null,null,null,null,null,null,null,null,null,96069]
[null,null,null,null,null,null,null,null,null,null,null,null,null,null,null,null,56520,null,null,null,null,null,null,null,null,null,null,null,null,null,null,96070]
[null,null,null,null,null,null,null,null,null,null,null,null,null,null,null,null,56524,null,null,null,null,null,null,null,null,null,null,null,null,null,null,96079]
[null,null,null,null,null,null,null,null,null,null,null,null,null,null,null,null,56525,null,null,null,null,null,null,null,null,null,null,null,null,null,null,96100]
[null,null,null,null,null,null,null,null,null,null,null,null,null,null,null,null,56526,null,null,null,null,null,null,null,null,null,null,null,null,null,null,96102]
[null,null,null,null,null,null,null,null,null,null,null,null,null,null,null,null,56527,null,null,null,null,null,null,null,null,null,null,null,null,null,null,96103]
[null,null,null,null,null,null,null,null,null,null,null,null,null,null,null,null,56528,null,null,null,null,null,null,null,null,null,null,null,null,null,null,96105]
[null,null,null,null,null,null,null,null,null,null,null,null,null,null,null,null,56529,null,null,null,null,null,null,null,null,null,null,null,null,null,null,96106]
[null,null,null,null,null,null,null,null,null,null,null,null,null,null,null,null,56530,null,null,null,null,null,null,null,null,null,null,null,null,null,null,96107]
[null,null,null,null,null,null,null,null,null,null,null,null,null,null,null,null,56535,null,null,null,null,null,null,null,null,null,null,null,null,null,null,96108]
[null,null,null,null,null,null,null,null,null,null,null,null,null,null,null,null,56536,null,null,null,null,null,null,null,null,null,null,null,null,null,null,96110]
[null,null,null,null,null,null,null,null,null,null,null,null,null,null,null,null,56537,null,null,null,null,null,null,null,null,null,null,null,null,null,null,96112]
[null,null,null,null,null,null,null,null,null,null,null,null,null,null,null,null,56538,null,null,null,null,null,null,null,null,null,null,null,null,null,null,96114]
[null,null,null,null,null,null,null,null,null,null,null,null,null,null,null,null,56539,null,null,null,null,null,null,null,null,null,null,null,null,null,null,96117]
[null,null,null,null,null,null,null,null,null,null,null,null,null,null,null,null,56540,null,null,null,null,null,null,null,null,null,null,null,null,null,null,96120]
[null,null,null,null,null,null,null,null,null,null,null,null,null,null,null,null,56550,null,null,null,null,null,null,null,null,null,null,null,null,null,null,96123]
[null,null,null,null,null,null,null,null,null,null,null,null,null,null,null,null,56553,null,null,null,null,null,null,null,null,null,null,null,null,null,null,96124]
[null,null,null,null,null,null,null,null,null,null,null,null,null,null,null,null,56555,null,null,null,null,null,null,null,null,null,null,null,null,null,null,96130]
[null,null,null,null,null,null,null,null,null,null,null,null,null,null,null,null,56556,null,null,null,null,null,null,null,null,null,null,null,null,null,null,96132]
[null,null,null,null,null,null,null,null,null,null,null,null,null,null,null,null,56558,null,null,null,null,null,null,null,null,null,null,null,null,null,null,96133]
[null,null,null,null,null,null,null,null,null,null,null,null,null,null,null,null,56560,null,null,null,null,null,null,null,null,null,null,null,null,null,null,96134]
[null,null,null,null,null,null,null,null,null,null,null,null,null,null,null,null,56563,null,null,null,null,null,null,null,null,null,null,null,null,null,null,96135]
[null,null,null,null,null,null,null,null,null,null,null,null,null,null,null,null,56564,null,null,null,null,null,null,null,null,null,null,null,null,null,null,96136]
[null,null,null,null,null,null,null,null,null,null,null,null,null,null,null,null,56565,null,null,null,null,null,null,null,null,null,null,null,null,null,null,96137]
[null,null,null,null,null,null,null,null,null,null,null,null,null,null,null,null,56566,null,null,null,null,null,null,null,null,null,null,null,null,null,null,96140]
[null,null,null,null,null,null,null,null,null,null,null,null,null,null,null,null,56567,null,null,null,null,null,null,null,null,null,null,null,null,null,null,96143]
[null,null,null,null,null,null,null,null,null,null,null,null,null,null,null,null,56568,null,null,null,null,null,null,null,null,null,null,null,null,null,null,96144]
[null,null,null,null,null,null,null,null,null,null,null,null,null,null,null,null,56569,null,null,null,null,null,null,null,null,null,null,null,null,null,null,96145]
[null,null,null,null,null,null,null,null,null,null,null,null,null,null,null,null,56570,null,null,null,null,null,null,null,null,null,null,null,null,null,null,96146]
[null,null,null,null,null,null,null,null,null,null,null,null,null,null,null,null,56576,null,null,null,null,null,null,null,null,null,null,null,null,null,null,96147]
[null,null,null,null,null,null,null,null,null,null,null,null,null,null,null,null,56577,null,null,null,null,null,null,null,null,null,null,null,null,null,null,96150]
[null,null,null,null,null,null,null,null,null,null,null,null,null,null,null,null,56579,null,null,null,null,null,null,null,null,null,null,null,null,null,null,96151]
[null,null,null,null,null,null,null,null,null,null,null,null,null,null,null,null,56580,null,null,null,null,null,null,null,null,null,null,null,null,null,null,96152]
[null,null,null,null,null,null,null,null,null,null,null,null,null,null,null,null,56584,null,null,null,null,null,null,null,null,null,null,null,null,null,null,96153]
[null,null,null,null,null,null,null,null,null,null,null,null,null,null,null,null,56585,null,null,null,null,null,null,null,null,null,null,null,null,null,null,96154]
[null,null,null,null,null,null,null,null,null,null,null,null,null,null,null,null,56586,null,null,null,null,null,null,null,null,null,null,null,null,null,null,96155]
[null,null,null,null,null,null,null,null,null,null,null,null,null,null,null,null,56587,null,null,null,null,null,null,null,null,null,null,null,null,null,null,96156]
[null,null,null,null,null,null,null,null,null,null,null,null,null,null,null,null,56588,null,null,null,null,null,null,null,null,null,null,null,null,null,null,96157]
[null,null,null,null,null,null,null,null,null,null,null,null,null,null,null,null,56589,null,null,null,null,null,null,null,null,null,null,null,null,null,null,96158]
[null,null,null,null,null,null,null,null,null,null,null,null,null,null,null,null,56590,null,null,null,null,null,null,null,null,null,null,null,null,null,null,96159]
[null,null,null,null,null,null,null,null,null,null,null,null,null,null,null,null,56599,null,null,null,null,null,null,null,null,null,null,null,null,null,null,96160]
[null,null,null,null,null,null,null,null,null,null,null,null,null,null,null,null,56600,null,null,null,null,null,null,null,null,null,null,null,null,null,null,96164]
[null,null,null,null,null,null,null,null,null,null,null,null,null,null,null,null,56604,null,null,null,null,null,null,null,null,null,null,null,null,null,null,96165]
[null,null,null,null,null,null,null,null,null,null,null,null,null,null,null,null,56605,null,null,null,null,null,null,null,null,null,null,null,null,null,null,96166]
[null,null,null,null,null,null,null,null,null,null,null,null,null,null,null,null,56606,null,null,null,null,null,null,null,null,null,null,null,null,null,null,96169]
[null,null,null,null,null,null,null,null,null,null,null,null,null,null,null,null,56607,null,null,null,null,null,null,null,null,null,null,null,null,null,null,96170]
[null,null,null,null,null,null,null,null,null,null,null,null,null,null,null,null,56608,null,null,null,null,null,null,null,null,null,null,null,null,null,null,96172]
[null,null,null,null,null,null,null,null,null,null,null,null,null,null,null,null,56609,null,null,null,null,null,null,null,null,null,null,null,null,null,null,96173]
[null,null,null,null,null,null,null,null,null,null,null,null,null,null,null,null,56610,null,null,null,null,null,null,null,null,null,null,null,null,null,null,96174]
[null,null,null,null,null,null,null,null,null,null,null,null,null,null,null,null,56613,null,null,null,null,null,null,null,null,null,null,null,null,null,null,96175]
[null,null,null,null,null,null,null,null,null,null,null,null,null,null,null,null,56614,null,null,null,null,null,null,null,null,null,null,null,null,null,null,96176]
[null,null,null,null,null,null,null,null,null,null,null,null,null,null,null,null,56615,null,null,null,null,null,null,null,null,null,null,null,null,null,null,96178]
[null,null,null,null,null,null,null,null,null,null,null,null,null,null,null,null,56616,null,null,null,null,null,null,null,null,null,null,null,null,null,null,96180]
[null,null,null,null,null,null,null,null,null,null,null,null,null,null,null,null,56617,null,null,null,null,null,null,null,null,null,null,null,null,null,null,96184]
[null,null,null,null,null,null,null,null,null,null,null,null,null,null,null,null,56618,null,null,null,null,null,null,null,null,null,null,null,null,null,null,96185]
[null,null,null,null,null,null,null,null,null,null,null,null,null,null,null,null,56619,null,null,null,null,null,null,null,null,null,null,null,null,null,null,96186]
[null,null,null,null,null,null,null,null,null,null,null,null,null,null,null,null,56620,null,null,null,null,null,null,null,null,null,null,null,null,null,null,96187]
[null,null,null,null,null,null,null,null,null,null,null,null,null,null,null,null,56623,null,null,null,null,null,null,null,null,null,null,null,null,null,null,96188]
[null,null,null,null,null,null,null,null,null,null,null,null,null,null,null,null,56624,null,null,null,null,null,null,null,null,null,null,null,null,null,null,96189]
[null,null,null,null,null,null,null,null,null,null,null,null,null,null,null,null,56625,null,null,null,null,null,null,null,null,null,null,null,null,null,null,96192]
[null,null,null,null,null,null,null,null,null,null,null,null,null,null,null,null,56640,null,null,null,null,null,null,null,null,null,null,null,null,null,null,96194]
[null,null,null,null,null,null,null,null,null,null,null,null,null,null,null,null,56641,null,null,null,null,null,null,null,null,null,null,null,null,null,null,96195]
[null,null,null,null,null,null,null,null,null,null,null,null,null,null,null,null,56642,null,null,null,null,null,null,null,null,null,null,null,null,null,null,96196]
[null,null,null,null,null,null,null,null,null,null,null,null,null,null,null,null,56643,null,null,null,null,null,null,null,null,null,null,null,null,null,null,96197]
[null,null,null,null,null,null,null,null,null,null,null,null,null,null,null,null,56644,null,null,null,null,null,null,null,null,null,null,null,null,null,null,96199]
[null,null,null,null,null,null,null,null,null,null,null,null,null,null,null,null,56646,null,null,null,null,null,null,null,null,null,null,null,null,null,null,96200]
[null,null,null,null,null,null,null,null,null,null,null,null,null,null,null,null,56647,null,null,null,null,null,null,null,null,null,null,null,null,null,null,96210]
[null,null,null,null,null,null,null,null,null,null,null,null,null,null,null,null,56650,null,null,null,null,null,null,null,null,null,null,null,null,null,null,96220]
[null,null,null,null,null,null,null,null,null,null,null,null,null,null,null,null,56653,null,null,null,null,null,null,null,null,null,null,null,null,null,null,96230]
[null,null,null,null,null,null,null,null,null,null,null,null,null,null,null,null,56654,null,null,null,null,null,null,null,null,null,null,null,null,null,null,96240]
[null,null,null,null,null,null,null,null,null,null,null,null,null,null,null,null,56655,null,null,null,null,null,null,null,null,null,null,null,null,null,null,96250]
[null,null,null,null,null,null,null,null,null,null,null,null,null,null,null,null,56656,null,null,null,null,null,null,null,null,null,null,null,null,null,null,96260]
[null,null,null,null,null,null,null,null,null,null,null,null,null,null,null,null,56657,null,null,null,null,null,null,null,null,null,null,null,null,null,null,96270]
[null,null,null,null,null,null,null,null,null,null,null,null,null,null,null,null,56680,null,null,null,null,null,null,null,null,null,null,null,null,null,null,96280]
[null,null,null,null,null,null,null,null,null,null,null,null,null,null,null,null,56683,null,null,null,null,null,null,null,null,null,null,null,null,null,null,96290]
[null,null,null,null,null,null,null,null,null,null,null,null,null,null,null,null,56684,null,null,null,null,null,null,null,null,null,null,null,null,null,null,96300]
[null,null,null,null,null,null,null,null,null,null,null,null,null,null,null,null,56700,null,null,null,null,null,null,null,null,null,null,null,null,null,null,96303]
[null,null,null,null,null,null,null,null,null,null,null,null,null,null,null,null,56703,null,null,null,null,null,null,null,null,null,null,null,null,null,null,96304]
[null,null,null,null,null,null,null,null,null,null,null,null,null,null,null,null,56704,null,null,null,null,null,null,null,null,null,null,null,null,null,null,96305]
[null,null,null,null,null,null,null,null,null,null,null,null,null,null,null,null,56710,null,null,null,null,null,null,null,null,null,null,null,null,null,null,96306]
[null,null,null,null,null,null,null,null,null,null,null,null,null,null,null,null,56713,null,null,null,null,null,null,null,null,null,null,null,null,null,null,96307]
[null,null,null,null,null,null,null,null,null,null,null,null,null,null,null,null,56714,null,null,null,null,null,null,null,null,null,null,null,null,null,null,96310]
[null,null,null,null,null,null,null,null,null,null,null,null,null,null,null,null,56715,null,null,null,null,null,null,null,null,null,null,null,null,null,null,96313]
[null,null,null,null,null,null,null,null,null,null,null,null,null,null,null,null,56716,null,null,null,null,null,null,null,null,null,null,null,null,null,null,96314]
[null,null,null,null,null,null,null,null,null,null,null,null,null,null,null,null,56720,null,null,null,null,null,null,null,null,null,null,null,null,null,null,96315]
[null,null,null,null,null,null,null,null,null,null,null,null,null,null,null,null,56723,null,null,null,null,null,null,null,null,null,null,null,null,null,null,96316]
[null,null,null,null,null,null,null,null,null,null,null,null,null,null,null,null,56726,null,null,null,null,null,null,null,null,null,null,null,null,null,null,96317]
[null,null,null,null,null,null,null,null,null,null,null,null,null,null,null,null,56730,null,null,null,null,null,null,null,null,null,null,null,null,null,null,96318]
[null,null,null,null,null,null,null,null,null,null,null,null,null,null,null,null,56731,null,null,null,null,null,null,null,null,null,null,null,null,null,null,96320]
[null,null,null,null,null,null,null,null,null,null,null,null,null,null,null,null,56735,null,null,null,null,null,null,null,null,null,null,null,null,null,null,96323]
[null,null,null,null,null,null,null,null,null,null,null,null,null,null,null,null,56740,null,null,null,null,null,null,null,null,null,null,null,null,null,null,96324]
[null,null,null,null,null,null,null,null,null,null,null,null,null,null,null,null,56743,null,null,null,null,null,null,null,null,null,null,null,null,null,null,96330]
[null,null,null,null,null,null,null,null,null,null,null,null,null,null,null,null,56744,null,null,null,null,null,null,null,null,null,null,null,null,null,null,96335]
[null,null,null,null,null,null,null,null,null,null,null,null,null,null,null,null,56745,null,null,null,null,null,null,null,null,null,null,null,null,null,null,96342]
[null,null,null,null,null,null,null,null,null,null,null,null,null,null,null,null,56746,null,null,null,null,null,null,null,null,null,null,null,null,null,null,96343]
[null,null,null,null,null,null,null,null,null,null,null,null,null,null,null,null,56747,null,null,null,null,null,null,null,null,null,null,null,null,null,null,96344]
[null,null,null,null,null,null,null,null,null,null,null,null,null,null,null,null,56760,null,null,null,null,null,null,null,null,null,null,null,null,null,null,96345]
[null,null,null,null,null,null,null,null,null,null,null,null,null,null,null,null,56763,null,null,null,null,null,null,null,null,null,null,null,null,null,null,96346]
[null,null,null,null,null,null,null,null,null,null,null,null,null,null,null,null,56765,null,null,null,null,null,null,null,null,null,null,null,null,null,null,96347]
[null,null,null,null,null,null,null,null,null,null,null,null,null,null,null,null,56766,null,null,null,null,null,null,null,null,null,null,null,null,null,null,96348]
[null,null,null,null,null,null,null,null,null,null,null,null,null,null,null,null,56767,null,null,null,null,null,null,null,null,null,null,null,null,null,null,96349]
[null,null,null,null,null,null,null,null,null,null,null,null,null,null,null,null,56770,null,null,null,null,null,null,null,null,null,null,null,null,null,null,96350]
[null,null,null,null,null,null,null,null,null,null,null,null,null,null,null,null,56776,null,null,null,null,null,null,null,null,null,null,null,null,null,null,96353]
[null,null,null,null,null,null,null,null,null,null,null,null,null,null,null,null,56780,null,null,null,null,null,null,null,null,null,null,null,null,null,null,96357]
[null,null,null,null,null,null,null,null,null,null,null,null,null,null,null,null,56783,null,null,null,null,null,null,null,null,null,null,null,null,null,null,96358]
[null,null,null,null,null,null,null,null,null,null,null,null,null,null,null,null,56784,null,null,null,null,null,null,null,null,null,null,null,null,null,null,96360]
[null,null,null,null,null,null,null,null,null,null,null,null,null,null,null,null,56785,null,null,null,null,null,null,null,null,null,null,null,null,null,null,96362]
[null,null,null,null,null,null,null,null,null,null,null,null,null,null,null,null,56800,null,null,null,null,null,null,null,null,null,null,null,null,null,null,96364]
[null,null,null,null,null,null,null,null,null,null,null,null,null,null,null,null,56803,null,null,null,null,null,null,null,null,null,null,null,null,null,null,96365]
[null,null,null,null,null,null,null,null,null,null,null,null,null,null,null,null,56804,null,null,null,null,null,null,null,null,null,null,null,null,null,null,96366]
[null,null,null,null,null,null,null,null,null,null,null,null,null,null,null,null,56805,null,null,null,null,null,null,null,null,null,null,null,null,null,null,96367]
[null,null,null,null,null,null,null,null,null,null,null,null,null,null,null,null,56806,null,null,null,null,null,null,null,null,null,null,null,null,null,null,96368]
[null,null,null,null,null,null,null,null,null,null,null,null,null,null,null,null,56810,null,null,null,null,null,null,null,null,null,null,null,null,null,null,96369]
[null,null,null,null,null,null,null,null,null,null,null,null,null,null,null,null,56813,null,null,null,null,null,null,null,null,null,null,null,null,null,null,96370]
[null,null,null,null,null,null,null,null,null,null,null,null,null,null,null,null,56814,null,null,null,null,null,null,null,null,null,null,null,null,null,null,96372]
[null,null,null,null,null,null,null,null,null,null,null,null,null,null,null,null,56815,null,null,null,null,null,null,null,null,null,null,null,null,null,null,96373]
[null,null,null,null,null,null,null,null,null,null,null,null,null,null,null,null,56816,null,null,null,null,null,null,null,null,null,null,null,null,null,null,96374]
[null,null,null,null,null,null,null,null,null,null,null,null,null,null,null,null,56820,null,null,null,null,null,null,null,null,null,null,null,null,null,null,96375]
[null,null,null,null,null,null,null,null,null,null,null,null,null,null,null,null,56860,null,null,null,null,null,null,null,null,null,null,null,null,null,null,96376]
[null,null,null,null,null,null,null,null,null,null,null,null,null,null,null,null,56863,null,null,null,null,null,null,null,null,null,null,null,null,null,null,96377]
[null,null,null,null,null,null,null,null,null,null,null,null,null,null,null,null,56864,null,null,null,null,null,null,null,null,null,null,null,null,null,null,96380]
[null,null,null,null,null,null,null,null,null,null,null,null,null,null,null,null,56866,null,null,null,null,null,null,null,null,null,null,null,null,null,null,96385]
[null,null,null,null,null,null,null,null,null,null,null,null,null,null,null,null,56867,null,null,null,null,null,null,null,null,null,null,null,null,null,null,96386]
[null,null,null,null,null,null,null,null,null,null,null,null,null,null,null,null,56870,null,null,null,null,null,null,null,null,null,null,null,null,null,null,96387]
[null,null,null,null,null,null,null,null,null,null,null,null,null,null,null,null,56880,null,null,null,null,null,null,null,null,null,null,null,null,null,null,96389]
[null,null,null,null,null,null,null,null,null,null,null,null,null,null,null,null,56884,null,null,null,null,null,null,null,null,null,null,null,null,null,null,96390]
[null,null,null,null,null,null,null,null,null,null,null,null,null,null,null,null,56885,null,null,null,null,null,null,null,null,null,null,null,null,null,null,96393]
[null,null,null,null,null,null,null,null,null,null,null,null,null,null,null,null,56890,null,null,null,null,null,null,null,null,null,null,null,null,null,null,96394]
[null,null,null,null,null,null,null,null,null,null,null,null,null,null,null,null,56893,null,null,null,null,null,null,null,null,null,null,null,null,null,null,96395]
[null,null,null,null,null,null,null,null,null,null,null,null,null,null,null,null,56894,null,null,null,null,null,null,null,null,null,null,null,null,null,null,96397]
[null,null,null,null,null,null,null,null,null,null,null,null,null,null,null,null,56900,null,null,null,null,null,null,null,null,null,null,null,null,null,null,96398]
[null,null,null,null,null,null,null,null,null,null,null,null,null,null,null,null,56903,null,null,null,null,null,null,null,null,null,null,null,null,null,null,96399]
[null,null,null,null,null,null,null,null,null,null,null,null,null,null,null,null,56904,null,null,null,null,null,null,null,null,null,null,null,null,null,null,96400]
[null,null,null,null,null,null,null,null,null,null,null,null,null,null,null,null,56905,null,null,null,null,null,null,null,null,null,null,null,null,null,null,96410]
[null,null,null,null,null,null,null,null,null,null,null,null,null,null,null,null,56913,null,null,null,null,null,null,null,null,null,null,null,null,null,null,96420]
[null,null,null,null,null,null,null,null,null,null,null,null,null,null,null,null,56914,null,null,null,null,null,null,null,null,null,null,null,null,null,null,96430]
[null,null,null,null,null,null,null,null,null,null,null,null,null,null,null,null,56920,null,null,null,null,null,null,null,null,null,null,null,null,null,null,96440]
[null,null,null,null,null,null,null,null,null,null,null,null,null,null,null,null,56923,null,null,null,null,null,null,null,null,null,null,null,null,null,null,96458]
[null,null,null,null,null,null,null,null,null,null,null,null,null,null,null,null,56924,null,null,null,null,null,null,null,null,null,null,null,null,null,null,96460]
[null,null,null,null,null,null,null,null,null,null,null,null,null,null,null,null,56930,null,null,null,null,null,null,null,null,null,null,null,null,null,null,96470]
[null,null,null,null,null,null,null,null,null,null,null,null,null,null,null,null,56933,null,null,null,null,null,null,null,null,null,null,null,null,null,null,96480]
[null,null,null,null,null,null,null,null,null,null,null,null,null,null,null,null,56935,null,null,null,null,null,null,null,null,null,null,null,null,null,null,96490]
[null,null,null,null,null,null,null,null,null,null,null,null,null,null,null,null,56940,null,null,null,null,null,null,null,null,null,null,null,null,null,null,96492]
[null,null,null,null,null,null,null,null,null,null,null,null,null,null,null,null,56945,null,null,null,null,null,null,null,null,null,null,null,null,null,null,96495]
[null,null,null,null,null,null,null,null,null,null,null,null,null,null,null,null,56950,null,null,null,null,null,null,null,null,null,null,null,null,null,null,96496]
[null,null,null,null,null,null,null,null,null,null,null,null,null,null,null,null,56953,null,null,null,null,null,null,null,null,null,null,null,null,null,null,96497]
[null,null,null,null,null,null,null,null,null,null,null,null,null,null,null,null,56954,null,null,null,null,null,null,null,null,null,null,null,null,null,null,96499]
[null,null,null,null,null,null,null,null,null,null,null,null,null,null,null,null,56955,null,null,null,null,null,null,null,null,null,null,null,null,null,null,96500]
[null,null,null,null,null,null,null,null,null,null,null,null,null,null,null,null,56956,null,null,null,null,null,null,null,null,null,null,null,null,null,null,96510]
[null,null,null,null,null,null,null,null,null,null,null,null,null,null,null,null,56960,null,null,null,null,null,null,null,null,null,null,null,null,null,null,96518]
[null,null,null,null,null,null,null,null,null,null,null,null,null,null,null,null,56963,null,null,null,null,null,null,null,null,null,null,null,null,null,null,96519]
[null,null,null,null,null,null,null,null,null,null,null,null,null,null,null,null,56965,null,null,null,null,null,null,null,null,null,null,null,null,null,null,96520]
[null,null,null,null,null,null,null,null,null,null,null,null,null,null,null,null,56970,null,null,null,null,null,null,null,null,null,null,null,null,null,null,96523]
[null,null,null,null,null,null,null,null,null,null,null,null,null,null,null,null,56973,null,null,null,null,null,null,null,null,null,null,null,null,null,null,96529]
[null,null,null,null,null,null,null,null,null,null,null,null,null,null,null,null,56974,null,null,null,null,null,null,null,null,null,null,null,null,null,null,96530]
[null,null,null,null,null,null,null,null,null,null,null,null,null,null,null,null,56975,null,null,null,null,null,null,null,null,null,null,null,null,null,null,96535]
[null,null,null,null,null,null,null,null,null,null,null,null,null,null,null,null,56976,null,null,null,null,null,null,null,null,null,null,null,null,null,null,96536]
[null,null,null,null,null,null,null,null,null,null,null,null,null,null,null,null,56980,null,null,null,null,null,null,null,null,null,null,null,null,null,null,96537]
[null,null,null,null,null,null,null,null,null,null,null,null,null,null,null,null,56982,null,null,null,null,null,null,null,null,null,null,null,null,null,null,96538]
[null,null,null,null,null,null,null,null,null,null,null,null,null,null,null,null,56983,null,null,null,null,null,null,null,null,null,null,null,null,null,null,96539]
[null,null,null,null,null,null,null,null,null,null,null,null,null,null,null,null,56984,null,null,null,null,null,null,null,null,null,null,null,null,null,null,96540]
[null,null,null,null,null,null,null,null,null,null,null,null,null,null,null,null,56990,null,null,null,null,null,null,null,null,null,null,null,null,null,null,96550]
[null,null,null,null,null,null,null,null,null,null,null,null,null,null,null,null,56993,null,null,null,null,null,null,null,null,null,null,null,null,null,null,96556]
[null,null,null,null,null,null,null,null,null,null,null,null,null,null,null,null,56996,null,null,null,null,null,null,null,null,null,null,null,null,null,null,96557]
[null,null,null,null,null,null,null,null,null,null,null,null,null,null,null,null,57000,null,null,null,null,null,null,null,null,null,null,null,null,null,null,96558]
[null,null,null,null,null,null,null,null,null,null,null,null,null,null,null,null,57100,null,null,null,null,null,null,null,null,null,null,null,null,null,null,96559]
[null,null,null,null,null,null,null,null,null,null,null,null,null,null,null,null,57103,null,null,null,null,null,null,null,null,null,null,null,null,null,null,96560]
[null,null,null,null,null,null,null,null,null,null,null,null,null,null,null,null,57120,null,null,null,null,null,null,null,null,null,null,null,null,null,null,96564]
[null,null,null,null,null,null,null,null,null,null,null,null,null,null,null,null,57129,null,null,null,null,null,null,null,null,null,null,null,null,null,null,96565]
[null,null,null,null,null,null,null,null,null,null,null,null,null,null,null,null,57130,null,null,null,null,null,null,null,null,null,null,null,null,null,null,96566]
[null,null,null,null,null,null,null,null,null,null,null,null,null,null,null,null,57138,null,null,null,null,null,null,null,null,null,null,null,null,null,null,96567]
[null,null,null,null,null,null,null,null,null,null,null,null,null,null,null,null,57139,null,null,null,null,null,null,null,null,null,null,null,null,null,null,96568]
[null,null,null,null,null,null,null,null,null,null,null,null,null,null,null,null,57140,null,null,null,null,null,null,null,null,null,null,null,null,null,null,96569]
[null,null,null,null,null,null,null,null,null,null,null,null,null,null,null,null,57150,null,null,null,null,null,null,null,null,null,null,null,null,null,null,96570]
[null,null,null,null,null,null,null,null,null,null,null,null,null,null,null,null,57158,null,null,null,null,null,null,null,null,null,null,null,null,null,null,96575]
[null,null,null,null,null,null,null,null,null,null,null,null,null,null,null,null,57170,null,null,null,null,null,null,null,null,null,null,null,null,null,null,96576]
[null,null,null,null,null,null,null,null,null,null,null,null,null,null,null,null,57171,null,null,null,null,null,null,null,null,null,null,null,null,null,null,96577]
[null,null,null,null,null,null,null,null,null,null,null,null,null,null,null,null,57178,null,null,null,null,null,null,null,null,null,null,null,null,null,null,96578]
[null,null,null,null,null,null,null,null,null,null,null,null,null,null,null,null,57179,null,null,null,null,null,null,null,null,null,null,null,null,null,null,96579]
[null,null,null,null,null,null,null,null,null,null,null,null,null,null,null,null,57180,null,null,null,null,null,null,null,null,null,null,null,null,null,null,96580]
[null,null,null,null,null,null,null,null,null,null,null,null,null,null,null,null,57185,null,null,null,null,null,null,null,null,null,null,null,null,null,null,96588]
[null,null,null,null,null,null,null,null,null,null,null,null,null,null,null,null,57188,null,null,null,null,null,null,null,null,null,null,null,null,null,null,96590]
[null,null,null,null,null,null,null,null,null,null,null,null,null,null,null,null,57189,null,null,null,null,null,null,null,null,null,null,null,null,null,null,96598]
[null,null,null,null,null,null,null,null,null,null,null,null,null,null,null,null,57200,null,null,null,null,null,null,null,null,null,null,null,null,null,null,96599]
[null,null,null,null,null,null,null,null,null,null,null,null,null,null,null,null,57205,null,null,null,null,null,null,null,null,null,null,null,null,null,null,96600]
[null,null,null,null,null,null,null,null,null,null,null,null,null,null,null,null,57210,null,null,null,null,null,null,null,null,null,null,null,null,null,null,96610]
[null,null,null,null,null,null,null,null,null,null,null,null,null,null,null,null,57300,null,null,null,null,null,null,null,null,null,null,null,null,null,null,96620]
[null,null,null,null,null,null,null,null,null,null,null,null,null,null,null,null,57310,null,null,null,null,null,null,null,null,null,null,null,null,null,null,96630]
[null,null,null,null,null,null,null,null,null,null,null,null,null,null,null,null,57400,null,null,null,null,null,null,null,null,null,null,null,null,null,null,96640]
[null,null,null,null,null,null,null,null,null,null,null,null,null,null,null,null,57410,null,null,null,null,null,null,null,null,null,null,null,null,null,null,96660]
[null,null,null,null,null,null,null,null,null,null,null,null,null,null,null,null,57420,null,null,null,null,null,null,null,null,null,null,null,null,null,null,96670]
[null,null,null,null,null,null,null,null,null,null,null,null,null,null,null,null,57425,null,null,null,null,null,null,null,null,null,null,null,null,null,null,96680]
[null,null,null,null,null,null,null,null,null,null,null,null,null,null,null,null,57430,null,null,null,null,null,null,null,null,null,null,null,null,null,null,96684]
[null,null,null,null,null,null,null,null,null,null,null,null,null,null,null,null,57440,null,null,null,null,null,null,null,null,null,null,null,null,null,null,96687]
[null,null,null,null,null,null,null,null,null,null,null,null,null,null,null,null,57450,null,null,null,null,null,null,null,null,null,null,null,null,null,null,96690]
[null,null,null,null,null,null,null,null,null,null,null,null,null,null,null,null,57460,null,null,null,null,null,null,null,null,null,null,null,null,null,null,96700]
[null,null,null,null,null,null,null,null,null,null,null,null,null,null,null,null,57465,null,null,null,null,null,null,null,null,null,null,null,null,null,null,96710]
[null,null,null,null,null,null,null,null,null,null,null,null,null,null,null,null,57500,null,null,null,null,null,null,null,null,null,null,null,null,null,null,96716]
[null,null,null,null,null,null,null,null,null,null,null,null,null,null,null,null,57510,null,null,null,null,null,null,null,null,null,null,null,null,null,null,96717]
[null,null,null,null,null,null,null,null,null,null,null,null,null,null,null,null,57520,null,null,null,null,null,null,null,null,null,null,null,null,null,null,96719]
[null,null,null,null,null,null,null,null,null,null,null,null,null,null,null,null,57530,null,null,null,null,null,null,null,null,null,null,null,null,null,null,96720]
[null,null,null,null,null,null,null,null,null,null,null,null,null,null,null,null,57600,null,null,null,null,null,null,null,null,null,null,null,null,null,null,96728]
[null,null,null,null,null,null,null,null,null,null,null,null,null,null,null,null,57610,null,null,null,null,null,null,null,null,null,null,null,null,null,null,96729]
[null,null,null,null,null,null,null,null,null,null,null,null,null,null,null,null,57620,null,null,null,null,null,null,null,null,null,null,null,null,null,null,96730]
[null,null,null,null,null,null,null,null,null,null,null,null,null,null,null,null,57630,null,null,null,null,null,null,null,null,null,null,null,null,null,null,96734]
[null,null,null,null,null,null,null,null,null,null,null,null,null,null,null,null,57700,null,null,null,null,null,null,null,null,null,null,null,null,null,null,96735]
[null,null,null,null,null,null,null,null,null,null,null,null,null,null,null,null,57708,null,null,null,null,null,null,null,null,null,null,null,null,null,null,96736]
[null,null,null,null,null,null,null,null,null,null,null,null,null,null,null,null,57709,null,null,null,null,null,null,null,null,null,null,null,null,null,null,96737]
[null,null,null,null,null,null,null,null,null,null,null,null,null,null,null,null,57710,null,null,null,null,null,null,null,null,null,null,null,null,null,null,96739]
[null,null,null,null,null,null,null,null,null,null,null,null,null,null,null,null,57718,null,null,null,null,null,null,null,null,null,null,null,null,null,null,96740]
[null,null,null,null,null,null,null,null,null,null,null,null,null,null,null,null,57719,null,null,null,null,null,null,null,null,null,null,null,null,null,null,96750]
[null,null,null,null,null,null,null,null,null,null,null,null,null,null,null,null,57720,null,null,null,null,null,null,null,null,null,null,null,null,null,null,96757]
[null,null,null,null,null,null,null,null,null,null,null,null,null,null,null,null,57730,null,null,null,null,null,null,null,null,null,null,null,null,null,null,96760]
[null,null,null,null,null,null,null,null,null,null,null,null,null,null,null,null,57739,null,null,null,null,null,null,null,null,null,null,null,null,null,null,96770]
[null,null,null,null,null,null,null,null,null,null,null,null,null,null,null,null,57740,null,null,null,null,null,null,null,null,null,null,null,null,null,null,96773]
[null,null,null,null,null,null,null,null,null,null,null,null,null,null,null,null,57750,null,null,null,null,null,null,null,null,null,null,null,null,null,null,96780]
[null,null,null,null,null,null,null,null,null,null,null,null,null,null,null,null,57760,null,null,null,null,null,null,null,null,null,null,null,null,null,null,96790]
[null,null,null,null,null,null,null,null,null,null,null,null,null,null,null,null,57800,null,null,null,null,null,null,null,null,null,null,null,null,null,null,96798]
[null,null,null,null,null,null,null,null,null,null,null,null,null,null,null,null,57809,null,null,null,null,null,null,null,null,null,null,null,null,null,null,96799]
[null,null,null,null,null,null,null,null,null,null,null,null,null,null,null,null,57810,null,null,null,null,null,null,null,null,null,null,null,null,null,null,96840]
[null,null,null,null,null,null,null,null,null,null,null,null,null,null,null,null,57819,null,null,null,null,null,null,null,null,null,null,null,null,null,null,96848]
[null,null,null,null,null,null,null,null,null,null,null,null,null,null,null,null,57820,null,null,null,null,null,null,null,null,null,null,null,null,null,null,96849]
[null,null,null,null,null,null,null,null,null,null,null,null,null,null,null,null,57830,null,null,null,null,null,null,null,null,null,null,null,null,null,null,96850]
[null,null,null,null,null,null,null,null,null,null,null,null,null,null,null,null,57840,null,null,null,null,null,null,null,null,null,null,null,null,null,null,96858]
[null,null,null,null,null,null,null,null,null,null,null,null,null,null,null,null,57849,null,null,null,null,null,null,null,null,null,null,null,null,null,null,96860]
[null,null,null,null,null,null,null,null,null,null,null,null,null,null,null,null,57900,null,null,null,null,null,null,null,null,null,null,null,null,null,null,96870]
[null,null,null,null,null,null,null,null,null,null,null,null,null,null,null,null,57910,null,null,null,null,null,null,null,null,null,null,null,null,null,null,96873]
[null,null,null,null,null,null,null,null,null,null,null,null,null,null,null,null,57920,null,null,null,null,null,null,null,null,null,null,null,null,null,null,96879]
[null,null,null,null,null,null,null,null,null,null,null,null,null,null,null,null,57930,null,null,null,null,null,null,null,null,null,null,null,null,null,null,96880]
[null,null,null,null,null,null,null,null,null,null,null,null,null,null,null,null,57940,null,null,null,null,null,null,null,null,null,null,null,null,null,null,96890]
[null,null,null,null,null,null,null,null,null,null,null,null,null,null,null,null,57950,null,null,null,null,null,null,null,null,null,null,null,null,null,null,96900]
[null,null,null,null,null,null,null,null,null,null,null,null,null,null,null,null,null,null,null,null,null,null,null,null,null,null,null,null,null,null,null,96903]
[null,null,null,null,null,null,null,null,null,null,null,null,null,null,null,null,null,null,null,null,null,null,null,null,null,null,null,null,null,null,null,96904]
[null,null,null,null,null,null,null,null,null,null,null,null,null,null,null,null,null,null,null,null,null,null,null,null,null,null,null,null,null,null,null,96905]
[null,null,null,null,null,null,null,null,null,null,null,null,null,null,null,null,null,null,null,null,null,null,null,null,null,null,null,null,null,null,null,96906]
[null,null,null,null,null,null,null,null,null,null,null,null,null,null,null,null,null,null,null,null,null,null,null,null,null,null,null,null,null,null,null,96907]
[null,null,null,null,null,null,null,null,null,null,null,null,null,null,null,null,null,null,null,null,null,null,null,null,null,null,null,null,null,null,null,96910]
[null,null,null,null,null,null,null,null,null,null,null,null,null,null,null,null,null,null,null,null,null,null,null,null,null,null,null,null,null,null,null,96913]
[null,null,null,null,null,null,null,null,null,null,null,null,null,null,null,null,null,null,null,null,null,null,null,null,null,null,null,null,null,null,null,96914]
[null,null,null,null,null,null,null,null,null,null,null,null,null,null,null,null,null,null,null,null,null,null,null,null,null,null,null,null,null,null,null,96915]
[null,null,null,null,null,null,null,null,null,null,null,null,null,null,null,null,null,null,null,null,null,null,null,null,null,null,null,null,null,null,null,96916]
[null,null,null,null,null,null,null,null,null,null,null,null,null,null,null,null,null,null,null,null,null,null,null,null,null,null,null,null,null,null,null,96917]
[null,null,null,null,null,null,null,null,null,null,null,null,null,null,null,null,null,null,null,null,null,null,null,null,null,null,null,null,null,null,null,96920]
[null,null,null,null,null,null,null,null,null,null,null,null,null,null,null,null,null,null,null,null,null,null,null,null,null,null,null,null,null,null,null,96923]
[null,null,null,null,null,null,null,null,null,null,null,null,null,null,null,null,null,null,null,null,null,null,null,null,null,null,null,null,null,null,null,96924]
[null,null,null,null,null,null,null,null,null,null,null,null,null,null,null,null,null,null,null,null,null,null,null,null,null,null,null,null,null,null,null,96925]
[null,null,null,null,null,null,null,null,null,null,null,null,null,null,null,null,null,null,null,null,null,null,null,null,null,null,null,null,null,null,null,96926]
[null,null,null,null,null,null,null,null,null,null,null,null,null,null,null,null,null,null,null,null,null,null,null,null,null,null,null,null,null,null,null,96927]
[null,null,null,null,null,null,null,null,null,null,null,null,null,null,null,null,null,null,null,null,null,null,null,null,null,null,null,null,null,null,null,96930]
[null,null,null,null,null,null,null,null,null,null,null,null,null,null,null,null,null,null,null,null,null,null,null,null,null,null,null,null,null,null,null,96933]
[null,null,null,null,null,null,null,null,null,null,null,null,null,null,null,null,null,null,null,null,null,null,null,null,null,null,null,null,null,null,null,96934]
[null,null,null,null,null,null,null,null,null,null,null,null,null,null,null,null,null,null,null,null,null,null,null,null,null,null,null,null,null,null,null,96936]
[null,null,null,null,null,null,null,null,null,null,null,null,null,null,null,null,null,null,null,null,null,null,null,null,null,null,null,null,null,null,null,96937]
[null,null,null,null,null,null,null,null,null,null,null,null,null,null,null,null,null,null,null,null,null,null,null,null,null,null,null,null,null,null,null,96938]
[null,null,null,null,null,null,null,null,null,null,null,null,null,null,null,null,null,null,null,null,null,null,null,null,null,null,null,null,null,null,null,96940]
[null,null,null,null,null,null,null,null,null,null,null,null,null,null,null,null,null,null,null,null,null,null,null,null,null,null,null,null,null,null,null,96943]
[null,null,null,null,null,null,null,null,null,null,null,null,null,null,null,null,null,null,null,null,null,null,null,null,null,null,null,null,null,null,null,96944]
[null,null,null,null,null,null,null,null,null,null,null,null,null,null,null,null,null,null,null,null,null,null,null,null,null,null,null,null,null,null,null,96945]
[null,null,null,null,null,null,null,null,null,null,null,null,null,null,null,null,null,null,null,null,null,null,null,null,null,null,null,null,null,null,null,96946]
[null,null,null,null,null,null,null,null,null,null,null,null,null,null,null,null,null,null,null,null,null,null,null,null,null,null,null,null,null,null,null,96947]
[null,null,null,null,null,null,null,null,null,null,null,null,null,null,null,null,null,null,null,null,null,null,null,null,null,null,null,null,null,null,null,96950]
[null,null,null,null,null,null,null,null,null,null,null,null,null,null,null,null,null,null,null,null,null,null,null,null,null,null,null,null,null,null,null,96952]
[null,null,null,null,null,null,null,null,null,null,null,null,null,null,null,null,null,null,null,null,null,null,null,null,null,null,null,null,null,null,null,96953]
[null,null,null,null,null,null,null,null,null,null,null,null,null,null,null,null,null,null,null,null,null,null,null,null,null,null,null,null,null,null,null,96954]
[null,null,null,null,null,null,null,null,null,null,null,null,null,null,null,null,null,null,null,null,null,null,null,null,null,null,null,null,null,null,null,96955]
[null,null,null,null,null,null,null,null,null,null,null,null,null,null,null,null,null,null,null,null,null,null,null,null,null,null,null,null,null,null,null,96956]
[null,null,null,null,null,null,null,null,null,null,null,null,null,null,null,null,null,null,null,null,null,null,null,null,null,null,null,null,null,null,null,96957]
[null,null,null,null,null,null,null,null,null,null,null,null,null,null,null,null,null,null,null,null,null,null,null,null,null,null,null,null,null,null,null,96960]
[null,null,null,null,null,null,null,null,null,null,null,null,null,null,null,null,null,null,null,null,null,null,null,null,null,null,null,null,null,null,null,96962]
[null,null,null,null,null,null,null,null,null,null,null,null,null,null,null,null,null,null,null,null,null,null,null,null,null,null,null,null,null,null,null,96963]
[null,null,null,null,null,null,null,null,null,null,null,null,null,null,null,null,null,null,null,null,null,null,null,null,null,null,null,null,null,null,null,96964]
[null,null,null,null,null,null,null,null,null,null,null,null,null,null,null,null,null,null,null,null,null,null,null,null,null,null,null,null,null,null,null,96965]
[null,null,null,null,null,null,null,null,null,null,null,null,null,null,null,null,null,null,null,null,null,null,null,null,null,null,null,null,null,null,null,96966]
[null,null,null,null,null,null,null,null,null,null,null,null,null,null,null,null,null,null,null,null,null,null,null,null,null,null,null,null,null,null,null,96967]
[null,null,null,null,null,null,null,null,null,null,null,null,null,null,null,null,null,null,null,null,null,null,null,null,null,null,null,null,null,null,null,96970]
[null,null,null,null,null,null,null,null,null,null,null,null,null,null,null,null,null,null,null,null,null,null,null,null,null,null,null,null,null,null,null,96973]
[null,null,null,null,null,null,null,null,null,null,null,null,null,null,null,null,null,null,null,null,null,null,null,null,null,null,null,null,null,null,null,96974]
[null,null,null,null,null,null,null,null,null,null,null,null,null,null,null,null,null,null,null,null,null,null,null,null,null,null,null,null,null,null,null,96975]
[null,null,null,null,null,null,null,null,null,null,null,null,null,null,null,null,null,null,null,null,null,null,null,null,null,null,null,null,null,null,null,96976]
[null,null,null,null,null,null,null,null,null,null,null,null,null,null,null,null,null,null,null,null,null,null,null,null,null,null,null,null,null,null,null,96977]
[null,null,null,null,null,null,null,null,null,null,null,null,null,null,null,null,null,null,null,null,null,null,null,null,null,null,null,null,null,null,null,96978]
[null,null,null,null,null,null,null,null,null,null,null,null,null,null,null,null,null,null,null,null,null,null,null,null,null,null,null,null,null,null,null,96980]
[null,null,null,null,null,null,null,null,null,null,null,null,null,null,null,null,null,null,null,null,null,null,null,null,null,null,null,null,null,null,null,96983]
[null,null,null,null,null,null,null,null,null,null,null,null,null,null,null,null,null,null,null,null,null,null,null,null,null,null,null,null,null,null,null,96984]
[null,null,null,null,null,null,null,null,null,null,null,null,null,null,null,null,null,null,null,null,null,null,null,null,null,null,null,null,null,null,null,96985]
[null,null,null,null,null,null,null,null,null,null,null,null,null,null,null,null,null,null,null,null,null,null,null,null,null,null,null,null,null,null,null,96986]
[null,null,null,null,null,null,null,null,null,null,null,null,null,null,null,null,null,null,null,null,null,null,null,null,null,null,null,null,null,null,null,96987]
[null,null,null,null,null,null,null,null,null,null,null,null,null,null,null,null,null,null,null,null,null,null,null,null,null,null,null,null,null,null,null,96988]
[null,null,null,null,null,null,null,null,null,null,null,null,null,null,null,null,null,null,null,null,null,null,null,null,null,null,null,null,null,null,null,96989]
[null,null,null,null,null,null,null,null,null,null,null,null,null,null,null,null,null,null,null,null,null,null,null,null,null,null,null,null,null,null,null,96990]
[null,null,null,null,null,null,null,null,null,null,null,null,null,null,null,null,null,null,null,null,null,null,null,null,null,null,null,null,null,null,null,96993]
[null,null,null,null,null,null,null,null,null,null,null,null,null,null,null,null,null,null,null,null,null,null,null,null,null,null,null,null,null,null,null,96994]
[null,null,null,null,null,null,null,null,null,null,null,null,null,null,null,null,null,null,null,null,null,null,null,null,null,null,null,null,null,null,null,96995]
[null,null,null,null,null,null,null,null,null,null,null,null,null,null,null,null,null,null,null,null,null,null,null,null,null,null,null,null,null,null,null,96996]
[null,null,null,null,null,null,null,null,null,null,null,null,null,null,null,null,null,null,null,null,null,null,null,null,null,null,null,null,null,null,null,96997]
[null,null,null,null,null,null,null,null,null,null,null,null,null,null,null,null,null,null,null,null,null,null,null,null,null,null,null,null,null,null,null,96998]

{"sheet":"Catalogos","index":3,"n_rows":97,"n_cols":61,"rows_kept":97,"cut":false,"hidden":false,"merged":[]}
["Emisor",null,null,"Periodos de Nómina",null,null,null,null,"Configuracion para grabar archivo",null,null,"Régimen de Contratación del Trabajador",null,null,"Catálogo de Bancos",null,null,null,"Riesgo de Puesto",null,null,"Tipo Percepción",null,null,null,"Tipo Deducción",null,null,null,"Tipo Incapacidad",null,null,null,"Catálogo de tipos de periodicidad del pago.",null,null,"Catálogo de estados. ",null,null,null,"Catálogo de tipos de Hora Extra.",null,null,null,"Catálogo de otro tipo de pago.",null,null,null,"Catálogo de tipos de nómina.",null,null,"Catálogo de tipos de jornada laboral.",null,null,"Catálogo de tipos de contrato.",null,null,"Catálogo de régimen fiscal.",null,"Aplica para tipo persona"]
["RFC","AAA010101AAA",null,"CODIGO NOMINA","FECHA DE PAGO","FECHA INICIAL PERIODO DE NOMINA","FECHA FINAL PERIODO DE NOMINA",null,"Descripción ","Valor",null,"c_TipoRegimen","Descripción",null,"c_Banco","Descripcion","Nombre o razón social",null,"c_RiesgoPuesto","Descripción",null,"c_TipoPercepcion","CONCEPTO PERCEPCIÓN","CÓDIGO PERCEPCIÓN INTERNO",null,"c_TipoDeduccion","CONCEPTO DEDUCCIÓN","CÓDIGO DEDUCCIÓN INTERNO",null,"c_TipoIncapacidad","Descripcion","Interno",null,"c_PeriodicidadPago","Descripcion",null,"c_Estado","c_Pais","Nombre del estado",null,"c_TipoHoras","Descripcion","Interno",null,"c_TipoOtroPago","Descripción","Interno",null,"c_TipoNomina","Descripcion",null,"c_TipoJornada","Descripcion",null,"c_TipoContrato","Descripcion",null,"c_RegimenFiscal","Descripcion","Física","Moral"]
["CURP",null,null,1,"2022-11-30","2022-11-16","2022-11-30",null,"Ruta a guardar el archivo txt (Terminar con diagonal  \\)","C:\\NOMINA\\",null,"02|Sueldos","Sueldos",null,"002|BANAMEX","BANAMEX","Banco Nacional de México, S.A., Institución de Banca Múltiple, Grupo Financiero Banamex",null,"1|Clase I","Clase I",null,"001|Sueldos, Salarios  Rayas y Jornales","Sueldos, Salarios  Rayas y Jornales","001",null,"001|Seguridad social","Seguridad social","001",null,"01|Riesgo de trabajo","Riesgo de trabajo","001",null,"01|Diario","Diario",null,"AGU|Aguascalientes","MEX","Aguascalientes",null,"01|Dobles","Dobles","001",null,"001|Reintegro de ISR pagado en exceso (siempre que no haya sido enterado al SAT).","Reintegro de ISR pagado en exceso","001",null,"O|Nómina ordinaria","Nómina ordinaria",null,"01|Diurna","Diurna",null,"01|Contrato de trabajo por tiempo indeterminado","Contrato de trabajo por tiempo indeterminado",null,"601|General de Ley Personas Morales","General de Ley Personas Morales","No","Sí"]
["VERSION ",1.2,null,null,null,null,null,null,"Nombre del archivo (con extension)","PRUEBA14.txt",null,"03|Jubilados","Jubilados",null,"006|BANCOMEXT","BANCOMEXT","Banco Nacional de Comercio Exterior, Sociedad Nacional de Crédito, Institución de Banca de Desarrollo",null,"2|Clase II","Clase II",null,"002|Gratificación Anual (Aguinaldo)","Gratificación Anual","002",null,"002|ISR","ISR","002",null,"02|Enfermedad en general","Enfermedad en general","002",null,"02|Semanal","Semanal",null,"BCN|Baja California","MEX","Baja California",null,"02|Triples","Triples","002",null,"002|Subsidio para el empleo (efectivamente entregado al trabajador).","Subsidio para el empleo","002",null,"E|Nómina extraordinaria","Nómina extraordinaria",null,"02|Nocturna","Nocturna",null,"02|Contrato de trabajo para obra determinada","Contrato de trabajo para obra determinada",null,"603|Personas Morales con Fines no Lucrativos","Personas Morales con Fines no Lucrativos","No","Sí"]
["REGISTRO PATRONAL","A9990009900",null,null,null,null,null,null,"Nombre de la pestaña a exportar","Plantilla",null,"04|Pensionados","Pensionados",null,"009|BANOBRAS","BANOBRAS","Banco Nacional de Obras y Servicios Públicos, Sociedad Nacional de Crédito, Institución de Banca de Desarrollo",null,"3|Clase III","Clase III",null,"003|Participación de los Trabajadores en las Utilidades PTU","Participación de los Trabajadores en las Utilidades PTU","003",null,"003|Aportaciones a retiro, cesantía en edad avanzada y vejez.","Aportaciones a retiro, cesantía en edad avanzada y vejez","003",null,"03|Maternidad","Maternidad","003",null,"03|Catorcenal","Catorcenal",null,"BCS|Baja California Sur","MEX","Baja California Sur",null,"03|Simples","Simples","003",null,"003|Viáticos (entregados al trabajador).","Viáticos","003",null,null,null,null,"03|Mixta","Mixta",null,"03|Contrato de trabajo por tiempo determinado","Contrato de trabajo por tiempo determinado",null,"605|Sueldos y Salarios e Ingresos Asimilados a Salarios","Sueldos y Salarios e Ingresos Asimilados a Salarios","Sí","No"]
["CÓDIGO RIESGO","1|Clase I",null,null,null,null,null,null,"Primera Columna de Encabezados","A2",null,"05|Asimilados Miembros Sociedades Cooperativas Produccion","Asimilados Miembros Sociedades Cooperativas Produccion",null,"012|BBVA BANCOMER","BBVA BANCOMER","BBVA Bancomer, S.A., Institución de Banca Múltiple, Grupo Financiero BBVA Bancomer",null,"4|Clase IV","Clase IV",null,"004|Reembolso de Gastos Médicos Dentales y Hospitalarios","Reembolso de Gastos Médicos Dentales y Hospitalarios","004",null,"004|Otros","Otros","004",null,null,null,null,null,"04|Quincenal","Quincenal",null,"CAM|Campeche","MEX","Campeche",null,null,null,null,null,"004|Aplicación de saldo a favor por compensación anual.","Aplicación de saldo a favor por compensación anual","004",null,null,null,null,"04|Por hora","Por hora",null,"04|Contrato de trabajo por temporada","Contrato de trabajo por temporada",null,"606|Arrendamiento","Arrendamiento","Sí","No"]
["PERIODICIDAD DEL PAGO","03|Catorcenal",null,null,null,null,null,null,null,null,null,"06|Asimilados Integrantes Sociedades Asociaciones Civiles","Asimilados Integrantes Sociedades Asociaciones Civiles",null,"014|SANTANDER","SANTANDER","Banco Santander (México), S.A., Institución de Banca Múltiple, Grupo Financiero Santander",null,"5|Clase V","Clase V",null,"005|Fondo de Ahorro","Fondo de Ahorro","005",null,"005|Aportaciones a Fondo de vivienda","Aportaciones a Fondo de vivienda","005",null,null,null,null,null,"05|Mensual","Mensual",null,"CHP|Chiapas","MEX","Chiapas",null,null,null,null,null,"999|Pagos distintos a los listados y que no deben considerarse como ingreso por sueldos, salarios o ingresos asimilados.","Pagos distintos a los listados y que no deben considerarse como ingreso por sueldos, salarios o ingresos asimilados","999",null,null,null,null,"05|Reducida","Reducida",null,"05|Contrato de trabajo sujeto a prueba","Contrato de trabajo sujeto a prueba",null,"608|Demás ingresos","Demás ingresos","Sí","No"]
["PERIODO DE NOMINA",1,null,null,null,null,null,null,null,null,null,"07|Asimilados Miembros consejos","Asimilados Miembros consejos",null,"019|BANJERCITO","BANJERCITO","Banco Nacional del Ejército, Fuerza Aérea y Armada, Sociedad Nacional de Crédito, Institución de Banca de Desarrollo",null,null,null,null,"006|Caja de ahorro","Caja de ahorro","006",null,"006|Descuento por incapacidad","Descuento por incapacidad","006",null,null,null,null,null,"06|Bimestral","Bimestral",null,"CHH|Chihuahua","MEX","Chihuahua",null,null,null,null,null,null,null,null,null,null,null,null,"06|Continuada","Continuada",null,"06|Contrato de trabajo con capacitación inicial","Contrato de trabajo con capacitación inicial",null,"609|Consolidación","Consolidación","No","Sí"]
["RÉGIMEN FISCAL","626|Régimen Simplificado de Confianza",null,null,null,null,null,null,"Primera celda","A3",null,"08|Asimilados comisionistas","Asimilados comisionistas",null,"021|HSBC","HSBC","HSBC México, S.A., institución De Banca Múltiple, Grupo Financiero HSBC",null,null,null,null,"009|Contribuciones a Cargo del Trabajador Pagadas por el Patrón","Contribuciones a Cargo del Trabajador Pagadas por el Patrón","009",null,"007|Pensión alimenticia","Pensión alimenticia","007",null,null,null,null,null,"07|Unidad obra","Unidad obra",null,"COA|Coahuila","MEX","Coahuila",null,null,null,null,null,null,null,null,null,null,null,null,"07|Partida","Partida",null,"07|Modalidad de contratación por pago de hora laborada","Modalidad de contratación por pago de hora laborada",null,"610|Residentes en el Extranjero sin Establecimiento Permanente en México","Residentes en el Extranjero sin Establecimiento Permanente en México","No","No"]
["CÓDIGO POSTAL","06000",null,null,null,null,null,null,"Ultima Celda","GW21",null,"09|Asimilados Honorarios","Asimilados Honorarios",null,"030|BAJIO","BAJIO","Banco del Bajío, S.A., Institución de Banca Múltiple",null,null,null,null,"010|Premios por puntualidad","Premios por puntualidad","010",null,"008|Renta","Renta","008",null,null,null,null,null,"08|Comisión","Comisión",null,"COL|Colima","MEX","Colima",null,null,null,null,null,null,null,null,null,null,null,null,"08|Por turnos","Por turnos",null,"08|Modalidad de trabajo por comisión laboral","Modalidad de trabajo por comisión laboral",null,"611|Ingresos por Dividendos (socios y accionistas)","Ingresos por Dividendos (socios y accionistas)","Sí","No"]
["TIPO NOMINA","O|Nómina ordinaria",null,null,null,null,null,null,"RANGO",{"$f":"RANGOPRIMERACELDA&\":\"&RANGOULTIMACELDA","v":"A3:GW21"},null,"10|Asimilados acciones","Asimilados acciones",null,"032|IXE","IXE","IXE Banco, S.A., Institución de Banca Múltiple, IXE Grupo Financiero",null,null,null,null,"011|Prima de Seguro de vida","Prima de Seguro de vida","011",null,"009|Préstamos provenientes del Fondo Nacional de la Vivienda para los Trabajadores","Préstamos provenientes del Fondo Nacional de la Vivienda para los Trabajadores","009",null,null,null,null,null,"09|Precio alzado","Precio alzado",null,"CMX|Ciudad de México","MEX","Ciudad de México",null,null,null,null,null,null,null,null,null,null,null,null,"99|Otra Jornada","Otra Jornada",null,"09|Modalidades de contratación donde no existe relación de trabajo","Modalidades de contratación donde no existe relación de trabajo",null,"612|Personas Físicas con Actividades Empresariales y Profesionales","Personas Físicas con Actividades Empresariales y Profesionales","Sí","No"]
[null,null,null,null,null,null,null,null,null,null,null,"11|Asimilados otros","Asimilados otros",null,"036|INBURSA","INBURSA","Banco Inbursa, S.A., Institución de Banca Múltiple, Grupo Financiero Inbursa",null,null,null,null,"012|Seguro de Gastos Médicos Mayores","Seguro de Gastos Médicos Mayores","012",null,"010|Pago por crédito de vivienda","Pago por crédito de vivienda","010",null,null,null,null,null,"99|Otra Periodicidad","Otra Periodicidad",null,"DUR|Durango","MEX","Durango",null,null,null,null,null,null,null,null,null,null,null,null,null,null,null,"10|Jubilación, pensión, retiro.","Jubilación, pensión, retiro",null,"614|Ingresos por intereses","Ingresos por intereses","Sí","No"]
[null,null,null,null,null,null,null,null,null,null,null,"99|Otro Regimen","Otro Regimen",null,"037|INTERACCIONES","INTERACCIONES","Banco Interacciones, S.A., Institución de Banca Múltiple",null,null,null,null,"013|Cuotas Sindicales Pagadas por el Patrón","Cuotas Sindicales Pagadas por el Patrón","013",null,"011|Pago de abonos INFONACOT","Pago de abonos INFONACOT","011",null,null,null,null,null,null,null,null,"GUA|Guanajuato","MEX","Guanajuato",null,null,null,null,null,null,null,null,null,null,null,null,null,null,null,"99|Otro contrato","Otro contrato",null,"616|Sin obligaciones fiscales","Sin obligaciones fiscales","Sí","No"]
[null,null,null,null,null,null,null,null,null,null,null,null,null,null,"042|MIFEL","MIFEL","Banca Mifel, S.A., Institución de Banca Múltiple, Grupo Financiero Mifel",null,null,null,null,"014|Subsidios por incapacidad","Subsidios por incapacidad","014",null,"012|Anticipo de salarios","Anticipo de salarios","012",null,null,null,null,null,null,null,null,"GRO|Guerrero","MEX","Guerrero",null,null,null,null,null,null,null,null,null,null,null,null,null,null,null,null,null,null,"620|Sociedades Cooperativas de Producción que optan por diferir sus ingresos","Sociedades Cooperativas de Producción que optan por diferir sus ingresos","No","Sí"]
[null,null,null,null,null,null,null,null,null,null,null,null,null,null,"044|SCOTIABANK","SCOTIABANK","Scotiabank Inverlat, S.A.",null,null,null,null,"015|Becas para trabajadores y/o hijos","Becas para trabajadores y/o hijos","015",null,"013|Pagos hechos con exceso al trabajador","Pagos hechos con exceso al trabajador","013",null,null,null,null,null,null,null,null,"HID|Hidalgo","MEX","Hidalgo",null,null,null,null,null,null,null,null,null,null,null,null,null,null,null,null,null,null,"621|Incorporación Fiscal","Incorporación Fiscal","Sí","No"]
[null,null,null,null,null,null,null,null,null,null,null,null,null,null,"058|BANREGIO","BANREGIO","Banco Regional de Monterrey, S.A., Institución de Banca Múltiple, Banregio Grupo Financiero",null,null,null,null,"019|Horas extra","Horas extra","019",null,"014|Errores","Errores","014",null,null,null,null,null,null,null,null,"JAL|Jalisco","MEX","Jalisco",null,null,null,null,null,null,null,null,null,null,null,null,null,null,null,null,null,null,"622|Actividades Agrícolas, Ganaderas, Silvícolas y Pesqueras","Actividades Agrícolas, Ganaderas, Silvícolas y Pesqueras","Sí","Sí"]
[null,null,null,null,null,null,null,null,null,null,null,null,null,null,"059|INVEX","INVEX","Banco Invex, S.A., Institución de Banca Múltiple, Invex Grupo Financiero",null,null,null,null,"020|Prima dominical","Prima dominical","020",null,"015|Pérdidas","Pérdidas","015",null,null,null,null,null,null,null,null,"MEX|Estado de México","MEX","Estado de México",null,null,null,null,null,null,null,null,null,null,null,null,null,null,null,null,null,null,"623|Opcional para Grupos de Sociedades","Opcional para Grupos de Sociedades","No","Sí"]
[null,null,null,null,null,null,null,null,null,null,null,null,null,null,"060|BANSI","BANSI","Bansi, S.A., Institución de Banca Múltiple",null,null,null,null,"021|Prima vacacional","Prima vacacional","021",null,"016|Averías","Averías","016",null,null,null,null,null,null,null,null,"MIC|Michoacán","MEX","Michoacán",null,null,null,null,null,null,null,null,null,null,null,null,null,null,null,null,null,null,"624|Coordinados","Coordinados","No","Sí"]
[null,null,null,null,null,null,null,null,null,null,null,null,null,null,"062|AFIRME","AFIRME","Banca Afirme, S.A., Institución de Banca Múltiple",null,null,null,null,"022|Prima por antigüedad","Prima por antigüedad","022",null,"017|Adquisición de artículos producidos por la empresa o establecimiento","Adquisición de artículos producidos por la empresa o establecimiento","017",null,null,null,null,null,null,null,null,"MOR|Morelos","MEX","Morelos",null,null,null,null,null,null,null,null,null,null,null,null,null,null,null,null,null,null,"628|Hidrocarburos","Hidrocarburos","No","Sí"]
[null,null,null,null,null,null,null,null,null,null,null,null,null,null,"072|BANORTE","BANORTE","Banco Mercantil del Norte, S.A., Institución de Banca Múltiple, Grupo Financiero Banorte",null,null,null,null,"023|Pagos por separación","Pagos por separación","023",null,"018|Cuotas para la constitución y fomento de sociedades cooperativas y de cajas de ahorro","Cuotas para la constitución y fomento de sociedades cooperativas y de cajas de ahorro","018",null,null,null,null,null,null,null,null,"NAY|Nayarit","MEX","Nayarit",null,null,null,null,null,null,null,null,null,null,null,null,null,null,null,null,null,null,"607|Régimen de Enajenación o Adquisición de Bienes","Régimen de Enajenación o Adquisición de Bienes","No","Sí"]
[null,null,null,null,null,null,null,null,null,null,null,null,null,null,"102|THE ROYAL BANK","THE ROYAL BANK","The Royal Bank of Scotland México, S.A., Institución de Banca Múltiple",null,null,null,null,"024|Seguro de retiro","Seguro de retiro","024",null,"019|Cuotas sindicales","Cuotas sindicales","019",null,null,null,null,null,null,null,null,"NLE|Nuevo León","MEX","Nuevo León",null,null,null,null,null,null,null,null,null,null,null,null,null,null,null,null,null,null,"629|De los Regímenes Fiscales Preferentes y de las Empresas Multinacionales","De los Regímenes Fiscales Preferentes y de las Empresas Multinacionales","Sí","No"]
[null,null,null,null,null,null,null,null,null,null,null,null,null,null,"103|AMERICAN EXPRESS","AMERICAN EXPRESS","American Express Bank (México), S.A., Institución de Banca Múltiple",null,null,null,null,"025|Indemnizaciones","Indemnizaciones","025",null,"020|Ausencia (Ausentismo)","Ausencia","020",null,null,null,null,null,null,null,null,"OAX|Oaxaca","MEX","Oaxaca",null,null,null,null,null,null,null,null,null,null,null,null,null,null,null,null,null,null,"630|Enajenación de acciones en bolsa de valores","Enajenación de acciones en bolsa de valores","Sí","No"]
[null,null,null,null,null,null,null,null,null,null,null,null,null,null,"106|BAMSA","BAMSA","Bank of America México, S.A., Institución de Banca Múltiple, Grupo Financiero Bank of America",null,null,null,null,"026|Reembolso por funeral","Reembolso por funeral","026",null,"021|Cuotas obrero patronales","Cuotas obrero patronales","021",null,null,null,null,null,null,null,null,"PUE|Puebla","MEX","Puebla",null,null,null,null,null,null,null,null,null,null,null,null,null,null,null,null,null,null,"615|Régimen de los ingresos por obtención de premios","Régimen de los ingresos por obtención de premios","Sí","No"]
[null,null,null,null,null,null,null,null,null,null,null,null,null,null,"108|TOKYO","TOKYO","Bank of Tokyo-Mitsubishi UFJ (México), S.A.",null,null,null,null,"027|Cuotas de seguridad social pagadas por el patrón","Cuotas de seguridad social pagadas por el patrón","027",null,"022|Impuestos Locales","Impuestos Locales","022",null,null,null,null,null,null,null,null,"QUE|Querétaro","MEX","Querétaro",null,null,null,null,null,null,null,null,null,null,null,null,null,null,null,null,null,null,"625|Régimen de las Actividades Empresariales con ingresos a través de Plataformas Tecnológicas","Régimen de las Actividades Empresariales con ingresos a través de Plataformas Tecnológicas","Sí","No"]
[null,null,null,null,null,null,null,null,null,null,null,null,null,null,"110|JP MORGAN","JP MORGAN","Banco J.P. Morgan, S.A., Institución de Banca Múltiple, J.P. Morgan Grupo Financiero",null,null,null,null,"028|Comisiones","Comisiones","028",null,"023|Aportaciones voluntarias","Aportaciones voluntarias","023",null,null,null,null,null,null,null,null,"ROO|Quintana Roo","MEX","Quintana Roo",null,null,null,null,null,null,null,null,null,null,null,null,null,null,null,null,null,null,"626|Régimen Simplificado de Confianza","Régimen Simplificado de Confianza","Sí","Sí"]
[null,null,null,null,null,null,null,null,null,null,null,null,null,null,"112|BMONEX","BMONEX","Banco Monex, S.A., Institución de Banca Múltiple",null,null,null,null,"029|Vales de despensa","Vales de despensa","029",null,null,null,null,null,null,null,null,null,null,null,null,"SLP|San Luis Potosí","MEX","San Luis Potosí"]
[null,null,null,null,null,null,null,null,null,null,null,null,null,null,"113|VE POR MAS","VE POR MAS","Banco Ve Por Mas, S.A. Institución de Banca Múltiple",null,null,null,null,"030|Vales de restaurante","Vales de restaurante","030",null,null,null,null,null,null,null,null,null,null,null,null,"SIN|Sinaloa","MEX","Sinaloa"]
[null,null,null,null,null,null,null,null,null,null,null,null,null,null,"116|ING","ING","ING Bank (México), S.A., Institución de Banca Múltiple, ING Grupo Financiero",null,null,null,null,"031|Vales de gasolina","Vales de gasolina","031",null,null,null,null,null,null,null,null,null,null,null,null,"SON|Sonora","MEX","Sonora"]
[null,null,null,null,null,null,null,null,null,null,null,null,null,null,"124|DEUTSCHE","DEUTSCHE","Deutsche Bank México, S.A., Institución de Banca Múltiple",null,null,null,null,"032|Vales de ropa","Vales de ropa","032",null,null,null,null,null,null,null,null,null,null,null,null,"TAB|Tabasco","MEX","Tabasco"]
[null,null,null,null,null,null,null,null,null,null,null,null,null,null,"126|CREDIT SUISSE","CREDIT SUISSE","Banco Credit Suisse (México), S.A. Institución de Banca Múltiple, Grupo Financiero Credit Suisse (México)",null,null,null,null,"033|Ayuda para renta","Ayuda para renta","033",null,null,null,null,null,null,null,null,null,null,null,null,"TAM|Tamaulipas","MEX","Tamaulipas"]
[null,null,null,null,null,null,null,null,null,null,null,null,null,null,"127|AZTECA","AZTECA","Banco Azteca, S.A. Institución de Banca Múltiple.",null,null,null,null,"034|Ayuda para artículos escolares","Ayuda para artículos escolares","034",null,null,null,null,null,null,null,null,null,null,null,null,"TLA|Tlaxcala","MEX","Tlaxcala"]
[null,null,null,null,null,null,null,null,null,null,null,null,null,null,"128|AUTOFIN","AUTOFIN","Banco Autofin México, S.A. Institución de Banca Múltiple",null,null,null,null,"035|Ayuda para anteojos","Ayuda para anteojos","035",null,null,null,null,null,null,null,null,null,null,null,null,"VER|Veracruz","MEX","Veracruz"]
[null,null,null,null,null,null,null,null,null,null,null,null,null,null,"129|BARCLAYS","BARCLAYS","Barclays Bank México, S.A., Institución de Banca Múltiple, Grupo Financiero Barclays México",null,null,null,null,"036|Ayuda para transporte","Ayuda para transporte","036",null,null,null,null,null,null,null,null,null,null,null,null,"YUC|Yucatán","MEX","Yucatán"]
[null,null,null,null,null,null,null,null,null,null,null,null,null,null,"130|COMPARTAMOS","COMPARTAMOS","Banco Compartamos, S.A., Institución de Banca Múltiple",null,null,null,null,"037|Ayuda para gastos de funeral","Ayuda para gastos de funeral","037",null,null,null,null,null,null,null,null,null,null,null,null,"ZAC|Zacatecas","MEX","Zacatecas"]
[null,null,null,null,null,null,null,null,null,null,null,null,null,null,"131|BANCO FAMSA","BANCO FAMSA","Banco Ahorro Famsa, S.A., Institución de Banca Múltiple",null,null,null,null,"038|Otros ingresos por salarios","Otros ingresos por salarios","038",null,null,null,null,null,null,null,null,null,null,null,null,"AL|Alabama","USA","Alabama"]
[null,null,null,null,null,null,null,null,null,null,null,null,null,null,"132|BMULTIVA","BMULTIVA","Banco Multiva, S.A., Institución de Banca Múltiple, Multivalores Grupo Financiero",null,null,null,null,"039|Jubilaciones, pensiones o haberes de retiro","Jubilaciones, pensiones o haberes de retiro","039",null,null,null,null,null,null,null,null,null,null,null,null,"AK|Alaska","USA","Alaska"]
[null,null,null,null,null,null,null,null,null,null,null,null,null,null,"133|ACTINVER","ACTINVER","Banco Actinver, S.A. Institución de Banca Múltiple, Grupo Financiero Actinver",null,null,null,null,"044|Jubilaciones, pensiones o haberes de retiro en parcialidades","Jubilaciones, pensiones o haberes de retiro en parcialidades","044",null,null,null,null,null,null,null,null,null,null,null,null,"AZ|Arizona","USA","Arizona"]
[null,null,null,null,null,null,null,null,null,null,null,null,null,null,"134|WAL-MART","WAL-MART","Banco Wal-Mart de México Adelante, S.A., Institución de Banca Múltiple",null,null,null,null,"045|Ingresos en acciones o títulos valor que representan bienes","Ingresos en acciones o títulos valor que representan bienes","045",null,null,null,null,null,null,null,null,null,null,null,null,"AR|Arkansas","USA","Arkansas"]
[null,null,null,null,null,null,null,null,null,null,null,null,null,null,"135|NAFIN","NAFIN","Nacional Financiera, Sociedad Nacional de Crédito, Institución de Banca de Desarrollo",null,null,null,null,"046|Ingresos asimilados a salarios","Ingresos asimilados a salarios","046",null,null,null,null,null,null,null,null,null,null,null,null,"CA|California","USA","California"]
[null,null,null,null,null,null,null,null,null,null,null,null,null,null,"136|INTERBANCO","INTERBANCO","Inter Banco, S.A. Institución de Banca Múltiple",null,null,null,null,"047|Alimentación","Alimentación","047",null,null,null,null,null,null,null,null,null,null,null,null,"NC|Carolina del Norte","USA","Carolina del Norte"]
[null,null,null,null,null,null,null,null,null,null,null,null,null,null,"137|BANCOPPEL","BANCOPPEL","BanCoppel, S.A., Institución de Banca Múltiple",null,null,null,null,"048|Habitación","Habitación","048",null,null,null,null,null,null,null,null,null,null,null,null,"SC|Carolina del Sur","USA","Carolina del Sur"]
[null,null,null,null,null,null,null,null,null,null,null,null,null,null,"138|ABC CAPITAL","ABC CAPITAL","ABC Capital, S.A., Institución de Banca Múltiple",null,null,null,null,"049|Premios por asistencia","Premios por asistencia","049",null,null,null,null,null,null,null,null,null,null,null,null,"CO|Colorado","USA","Colorado"]
[null,null,null,null,null,null,null,null,null,null,null,null,null,null,"139|UBS BANK","UBS BANK","UBS Bank México, S.A., Institución de Banca Múltiple, UBS Grupo Financiero",null,null,null,null,null,null,null,null,null,null,null,null,null,null,null,null,null,null,null,"CT|Connecticut","USA","Connecticut"]
[null,null,null,null,null,null,null,null,null,null,null,null,null,null,"140|CONSUBANCO","CONSUBANCO","Consubanco, S.A. Institución de Banca Múltiple",null,null,null,null,null,null,null,null,null,null,null,null,null,null,null,null,null,null,null,"ND|Dakota del Norte","USA","Dakota del Norte"]
[null,null,null,null,null,null,null,null,null,null,null,null,null,null,"141|VOLKSWAGEN","VOLKSWAGEN","Volkswagen Bank, S.A., Institución de Banca Múltiple",null,null,null,null,null,null,null,null,null,null,null,null,null,null,null,null,null,null,null,"SD|Dakota del Sur","USA","Dakota del Sur"]
[null,null,null,null,null,null,null,null,null,null,null,null,null,null,"143|CIBANCO","CIBANCO","CIBanco, S.A.",null,null,null,null,null,null,null,null,null,null,null,null,null,null,null,null,null,null,null,"DE|Delaware","USA","Delaware"]
[null,null,null,null,null,null,null,null,null,null,null,null,null,null,"145|BBASE","BBASE","Banco Base, S.A., Institución de Banca Múltiple",null,null,null,null,null,null,null,null,null,null,null,null,null,null,null,null,null,null,null,"FL|Florida","USA","Florida"]
[null,null,null,null,null,null,null,null,null,null,null,null,null,null,"166|BANSEFI","BANSEFI","Banco del Ahorro Nacional y Servicios Financieros, Sociedad Nacional de Crédito, Institución de Banca de Desarrollo",null,null,null,null,null,null,null,null,null,null,null,null,null,null,null,null,null,null,null,"GA|Georgia","USA","Georgia"]
[null,null,null,null,null,null,null,null,null,null,null,null,null,null,"168|HIPOTECARIA FEDERAL","HIPOTECARIA FEDERAL","Sociedad Hipotecaria Federal, Sociedad Nacional de Crédito, Institución de Banca de Desarrollo",null,null,null,null,null,null,null,null,null,null,null,null,null,null,null,null,null,null,null,"HI|Hawái","USA","Hawái"]
[null,null,null,null,null,null,null,null,null,null,null,null,null,null,"600|MONEXCB","MONEXCB","Monex Casa de Bolsa, S.A. de C.V. Monex Grupo Financiero",null,null,null,null,null,null,null,null,null,null,null,null,null,null,null,null,null,null,null,"ID|Idaho","USA","Idaho"]
[null,null,null,null,null,null,null,null,null,null,null,null,null,null,"601|GBM","GBM","GBM Grupo Bursátil Mexicano, S.A. de C.V. Casa de Bolsa",null,null,null,null,null,null,null,null,null,null,null,null,null,null,null,null,null,null,null,"IL|Illinois","USA","Illinois"]
[null,null,null,null,null,null,null,null,null,null,null,null,null,null,"602|MASARI","MASARI","Masari Casa de Bolsa, S.A.",null,null,null,null,null,null,null,null,null,null,null,null,null,null,null,null,null,null,null,"IN|Indiana","USA","Indiana"]
[null,null,null,null,null,null,null,null,null,null,null,null,null,null,"605|VALUE","VALUE","Value, S.A. de C.V. Casa de Bolsa",null,null,null,null,null,null,null,null,null,null,null,null,null,null,null,null,null,null,null,"IA|Iowa","USA","Iowa"]
[null,null,null,null,null,null,null,null,null,null,null,null,null,null,"606|ESTRUCTURADORES","ESTRUCTURADORES","Estructuradores del Mercado de Valores Casa de Bolsa, S.A. de C.V.",null,null,null,null,null,null,null,null,null,null,null,null,null,null,null,null,null,null,null,"KS|Kansas","USA","Kansas"]
[null,null,null,null,null,null,null,null,null,null,null,null,null,null,"607|TIBER","TIBER","Casa de Cambio Tiber, S.A. de C.V.",null,null,null,null,null,null,null,null,null,null,null,null,null,null,null,null,null,null,null,"KY|Kentucky","USA","Kentucky"]
[null,null,null,null,null,null,null,null,null,null,null,null,null,null,"608|VECTOR","VECTOR","Vector Casa de Bolsa, S.A. de C.V.",null,null,null,null,null,null,null,null,null,null,null,null,null,null,null,null,null,null,null,"LA|Luisiana","USA","Luisiana"]
[null,null,null,null,null,null,null,null,null,null,null,null,null,null,"610|B&B","B&B","B y B, Casa de Cambio, S.A. de C.V.",null,null,null,null,null,null,null,null,null,null,null,null,null,null,null,null,null,null,null,"ME|Maine","USA","Maine"]
[null,null,null,null,null,null,null,null,null,null,null,null,null,null,"614|ACCIVAL","ACCIVAL","Acciones y Valores Banamex, S.A. de C.V., Casa de Bolsa",null,null,null,null,null,null,null,null,null,null,null,null,null,null,null,null,null,null,null,"MD|Maryland","USA","Maryland"]
[null,null,null,null,null,null,null,null,null,null,null,null,null,null,"615|MERRILL LYNCH","MERRILL LYNCH","Merrill Lynch México, S.A. de C.V. Casa de Bolsa",null,null,null,null,null,null,null,null,null,null,null,null,null,null,null,null,null,null,null,"MA|Massachusetts","USA","Massachusetts"]
[null,null,null,null,null,null,null,null,null,null,null,null,null,null,"616|FINAMEX","FINAMEX","Casa de Bolsa Finamex, S.A. de C.V.",null,null,null,null,null,null,null,null,null,null,null,null,null,null,null,null,null,null,null,"MI|Míchigan","USA","Míchigan"]
[null,null,null,null,null,null,null,null,null,null,null,null,null,null,"617|VALMEX","VALMEX","Valores Mexicanos Casa de Bolsa, S.A. de C.V.",null,null,null,null,null,null,null,null,null,null,null,null,null,null,null,null,null,null,null,"MN|Minnesota","USA","Minnesota"]
[null,null,null,null,null,null,null,null,null,null,null,null,null,null,"618|UNICA","UNICA","Unica Casa de Cambio, S.A. de C.V.",null,null,null,null,null,null,null,null,null,null,null,null,null,null,null,null,null,null,null,"MS|Misisipi","USA","Misisipi"]
[null,null,null,null,null,null,null,null,null,null,null,null,null,null,"619|MAPFRE","MAPFRE","MAPFRE Tepeyac, S.A.",null,null,null,null,null,null,null,null,null,null,null,null,null,null,null,null,null,null,null,"MO|Misuri","USA","Misuri"]
[null,null,null,null,null,null,null,null,null,null,null,null,null,null,"620|PROFUTURO","PROFUTURO","Profuturo G.N.P., S.A. de C.V., Afore",null,null,null,null,null,null,null,null,null,null,null,null,null,null,null,null,null,null,null,"MT|Montana","USA","Montana"]
[null,null,null,null,null,null,null,null,null,null,null,null,null,null,"621|CB ACTINVER","CB ACTINVER","Actinver Casa de Bolsa, S.A. de C.V.",null,null,null,null,null,null,null,null,null,null,null,null,null,null,null,null,null,null,null,"NE|Nebraska","USA","Nebraska"]
[null,null,null,null,null,null,null,null,null,null,null,null,null,null,"622|OACTIN","OACTIN","OPERADORA ACTINVER, S.A. DE C.V.",null,null,null,null,null,null,null,null,null,null,null,null,null,null,null,null,null,null,null,"NV|Nevada","USA","Nevada"]
[null,null,null,null,null,null,null,null,null,null,null,null,null,null,"623|SKANDIA","SKANDIA","Skandia Vida, S.A. de C.V.",null,null,null,null,null,null,null,null,null,null,null,null,null,null,null,null,null,null,null,"NJ|Nueva Jersey","USA","Nueva Jersey"]
[null,null,null,null,null,null,null,null,null,null,null,null,null,null,"626|CBDEUTSCHE","CBDEUTSCHE","Deutsche Securities, S.A. de C.V. CASA DE BOLSA",null,null,null,null,null,null,null,null,null,null,null,null,null,null,null,null,null,null,null,"NY|Nueva York","USA","Nueva York"]
[null,null,null,null,null,null,null,null,null,null,null,null,null,null,"627|ZURICH","ZURICH","Zurich Compañía de Seguros, S.A.",null,null,null,null,null,null,null,null,null,null,null,null,null,null,null,null,null,null,null,"NH|Nuevo Hampshire","USA","Nuevo Hampshire"]
[null,null,null,null,null,null,null,null,null,null,null,null,null,null,"628|ZURICHVI","ZURICHVI","Zurich Vida, Compañía de Seguros, S.A.",null,null,null,null,null,null,null,null,null,null,null,null,null,null,null,null,null,null,null,"NM|Nuevo México","USA","Nuevo México"]
[null,null,null,null,null,null,null,null,null,null,null,null,null,null,"629|SU CASITA","SU CASITA","Hipotecaria Su Casita, S.A. de C.V. SOFOM ENR",null,null,null,null,null,null,null,null,null,null,null,null,null,null,null,null,null,null,null,"OH|Ohio","USA","Ohio"]
[null,null,null,null,null,null,null,null,null,null,null,null,null,null,"630|CB INTERCAM","CB INTERCAM","Intercam Casa de Bolsa, S.A. de C.V.",null,null,null,null,null,null,null,null,null,null,null,null,null,null,null,null,null,null,null,"OK|Oklahoma","USA","Oklahoma"]
[null,null,null,null,null,null,null,null,null,null,null,null,null,null,"631|CI BOLSA","CI BOLSA","CI Casa de Bolsa, S.A. de C.V.",null,null,null,null,null,null,null,null,null,null,null,null,null,null,null,null,null,null,null,"OR|Oregón","USA","Oregón"]
[null,null,null,null,null,null,null,null,null,null,null,null,null,null,"632|BULLTICK CB","BULLTICK CB","Bulltick Casa de Bolsa, S.A., de C.V.",null,null,null,null,null,null,null,null,null,null,null,null,null,null,null,null,null,null,null,"PA|Pensilvania","USA","Pensilvania"]
[null,null,null,null,null,null,null,null,null,null,null,null,null,null,"633|STERLING","STERLING","Sterling Casa de Cambio, S.A. de C.V.",null,null,null,null,null,null,null,null,null,null,null,null,null,null,null,null,null,null,null,"RI|Rhode Island","USA","Rhode Island"]
[null,null,null,null,null,null,null,null,null,null,null,null,null,null,"634|FINCOMUN","FINCOMUN","Fincomún, Servicios Financieros Comunitarios, S.A. de C.V.",null,null,null,null,null,null,null,null,null,null,null,null,null,null,null,null,null,null,null,"TN|Tennessee","USA","Tennessee"]
[null,null,null,null,null,null,null,null,null,null,null,null,null,null,"636|HDI SEGUROS","HDI SEGUROS","HDI Seguros, S.A. de C.V.",null,null,null,null,null,null,null,null,null,null,null,null,null,null,null,null,null,null,null,"TX|Texas","USA","Texas"]
[null,null,null,null,null,null,null,null,null,null,null,null,null,null,"637|ORDER","ORDER","Order Express Casa de Cambio, S.A. de C.V",null,null,null,null,null,null,null,null,null,null,null,null,null,null,null,null,null,null,null,"UT|Utah","USA","Utah"]
[null,null,null,null,null,null,null,null,null,null,null,null,null,null,"638|AKALA","AKALA","Akala, S.A. de C.V., Sociedad Financiera Popular",null,null,null,null,null,null,null,null,null,null,null,null,null,null,null,null,null,null,null,"VT|Vermont","USA","Vermont"]
[null,null,null,null,null,null,null,null,null,null,null,null,null,null,"640|CB JPMORGAN","CB JPMORGAN","J.P. Morgan Casa de Bolsa, S.A. de C.V. J.P. Morgan Grupo Financiero",null,null,null,null,null,null,null,null,null,null,null,null,null,null,null,null,null,null,null,"VA|Virginia","USA","Virginia"]
[null,null,null,null,null,null,null,null,null,null,null,null,null,null,"642|REFORMA","REFORMA","Operadora de Recursos Reforma, S.A. de C.V., S.F.P.",null,null,null,null,null,null,null,null,null,null,null,null,null,null,null,null,null,null,null,"WV|Virginia Occidental","USA","Virginia Occidental"]
[null,null,null,null,null,null,null,null,null,null,null,null,null,null,"646|STP","STP","Sistema de Transferencias y Pagos STP, S.A. de C.V.SOFOM ENR",null,null,null,null,null,null,null,null,null,null,null,null,null,null,null,null,null,null,null,"WA|Washington","USA","Washington"]
[null,null,null,null,null,null,null,null,null,null,null,null,null,null,"647|TELECOMM","TELECOMM","Telecomunicaciones de México",null,null,null,null,null,null,null,null,null,null,null,null,null,null,null,null,null,null,null,"WI|Wisconsin","USA","Wisconsin"]
[null,null,null,null,null,null,null,null,null,null,null,null,null,null,"648|EVERCORE","EVERCORE","Evercore Casa de Bolsa, S.A. de C.V.",null,null,null,null,null,null,null,null,null,null,null,null,null,null,null,null,null,null,null,"WY|Wyoming","USA","Wyoming"]
[null,null,null,null,null,null,null,null,null,null,null,null,null,null,"649|SKANDIA","SKANDIA","Skandia Operadora de Fondos, S.A. de C.V.",null,null,null,null,null,null,null,null,null,null,null,null,null,null,null,null,null,null,null,"ON|Ontario ","CAN","Ontario "]
[null,null,null,null,null,null,null,null,null,null,null,null,null,null,"651|SEGMTY","SEGMTY","Seguros Monterrey New York Life, S.A de C.V",null,null,null,null,null,null,null,null,null,null,null,null,null,null,null,null,null,null,null,"QC| Quebec ","CAN"," Quebec "]
[null,null,null,null,null,null,null,null,null,null,null,null,null,null,"652|ASEA","ASEA","Solución Asea, S.A. de C.V., Sociedad Financiera Popular",null,null,null,null,null,null,null,null,null,null,null,null,null,null,null,null,null,null,null,"NS| Nueva Escocia","CAN"," Nueva Escocia"]
[null,null,null,null,null,null,null,null,null,null,null,null,null,null,"653|KUSPIT","KUSPIT","Kuspit Casa de Bolsa, S.A. de C.V.",null,null,null,null,null,null,null,null,null,null,null,null,null,null,null,null,null,null,null,"NB|Nuevo Brunswick ","CAN","Nuevo Brunswick "]
[null,null,null,null,null,null,null,null,null,null,null,null,null,null,"655|SOFIEXPRESS","SOFIEXPRESS","J.P. SOFIEXPRESS, S.A. de C.V., S.F.P.",null,null,null,null,null,null,null,null,null,null,null,null,null,null,null,null,null,null,null,"MB| Manitoba","CAN"," Manitoba"]
[null,null,null,null,null,null,null,null,null,null,null,null,null,null,"656|UNAGRA","UNAGRA","UNAGRA, S.A. de C.V., S.F.P.",null,null,null,null,null,null,null,null,null,null,null,null,null,null,null,null,null,null,null,"BC| Columbia Británica","CAN"," Columbia Británica"]
[null,null,null,null,null,null,null,null,null,null,null,null,null,null,"659|OPCIONES EMPRESARIALES DEL NOROESTE","OPCIONES EMPRESARIALES DEL NOROESTE","OPCIONES EMPRESARIALES DEL NORESTE, S.A. DE C.V., S.F.P.",null,null,null,null,null,null,null,null,null,null,null,null,null,null,null,null,null,null,null,"PE| Isla del Príncipe Eduardo","CAN"," Isla del Príncipe Eduardo"]
[null,null,null,null,null,null,null,null,null,null,null,null,null,null,"901|CLS","CLS","Cls Bank International",null,null,null,null,null,null,null,null,null,null,null,null,null,null,null,null,null,null,null,"SK| Saskatchewan","CAN"," Saskatchewan"]
[null,null,null,null,null,null,null,null,null,null,null,null,null,null,"902|INDEVAL","INDEVAL","SD. Indeval, S.A. de C.V.",null,null,null,null,null,null,null,null,null,null,null,null,null,null,null,null,null,null,null,"AB| Alberta","CAN"," Alberta"]
[null,null,null,null,null,null,null,null,null,null,null,null,null,null,"670|LIBERTAD","LIBERTAD","Libertad Servicios Financieros, S.A. De C.V.",null,null,null,null,null,null,null,null,null,null,null,null,null,null,null,null,null,null,null,"NL| Terranova y Labrador","CAN"," Terranova y Labrador"]
[null,null,null,null,null,null,null,null,null,null,null,null,null,null,null,null,null,null,null,null,null,null,null,null,null,null,null,null,null,null,null,null,null,null,null,null,"NT| Territorios del Noroeste","CAN"," Territorios del Noroeste"]
[null,null,null,null,null,null,null,null,null,null,null,null,null,null,null,null,null,null,null,null,null,null,null,null,null,null,null,null,null,null,null,null,null,null,null,null,"YT| Yukón","CAN"," Yukón"]
[null,null,null,null,null,null,null,null,null,null,null,null,null,null,null,null,null,null,null,null,null,null,null,null,null,null,null,null,null,null,null,null,null,null,null,null,"UN| Nunavut","CAN"," Nunavut"]

{"sheet":"Trabajadores","index":4,"n_rows":20,"n_cols":26,"rows_kept":20,"cut":false,"hidden":false,"merged":[]}
[1,2,3,4,5,6,7,8,9,10,11,12,13,14,15,16,17,18,19,20,21,22,23,24,25,26]
["NUMERO DE EMPLEADO","RFC","NOMBRE","APELLIDO PATERNO","APELLIDO MATERNO","CURP","CODIGO POSTAL","NSS IMSS","FECHA INICIO RELACIÓN LABORAL","ANTIGÜEDAD","CODIGO TIPO DE CONTRATO","SINDICALIZADO","CODIGO TIPO DE JORNADA","CÓDIGO TIPO DE RÉGIMEN","DEPARTAMENTO","PUESTO","CÓDIGO RIESGO DE PUESTO","CÓDIGO DE PERIODICIDAD DE PAGO","CÓDIGO DE BANCO","CUENTA BANCARIA","SALARIO BASE","SALARIO DIARIO INTEGRADO","CODIGO DE ENTIDAD FEDERATIVA","EMAIL 1","EMAIL 2","NÚMERO DE DÍAS PAGADOS"]
[1,"XAXX010101XXX",null,null,null,null,null,null,"2019-04-16",{"$f":"INT(fechaAntiguedad(I3))","v":189},"01|Contrato de trabajo por tiempo indeterminado","No","01|Diurna","02|Sueldos",null,"Auxiliar de recepcion","1|Clase I","03|Catorcenal",null,null,300,200,null,"ejemplo@gmail.com"]
[2,"XAXX010101XXX",null,null,null,null,null,null,"2022-10-01",{"$f":"INT(fechaAntiguedad(I4))","v":8},"01|Contrato de trabajo por tiempo indeterminado","No","01|Diurna","02|Sueldos",null,"Cajera","1|Clase I","03|Catorcenal"]
[]
[]
[]
[]
[]
[null,null,null,null,"    ",null,null,null,null,null,null,null,null,null,null,null,null,null,null,null,null,null,null,null,"   "]
[]
[]
[null,null,null," "]
[]
[]
[]
[]
[]
[]
[null,null,null,null,null,null,null,null,null,null,null,null,null,null,null,null,null,null,null,null," "]

{"sheet":"Plantilla","index":5,"n_rows":4,"n_cols":204,"rows_kept":4,"cut":false,"hidden":false,"merged":[]}
[]
["RFC","CURP","REGISTRO PATRONAL","RÉGIMEN FISCAL","CÓDIGO POSTAL","FOLIO","VERSION ","CÓDIGO TIPO NÓMINA","FECHA DE PAGO","FECHA INICIAL PERIODO DE NÓMINA","FECHA FINAL PERIODO DE NÓMINA","NÚMERO DE DÍAS PAGADOS","NÚMERO DE NÓMINA","RECEPTOR RFC","RECEPTOR NOMBRE","RECEPTOR CURP","NÚMERO SEGURIDAD SOCIAL","RECEPTOR CODIGO POSTAL","FECHA INICIO RELACIÓN LABORAL","ANTIGÜEDAD","CÓDIGO TIPO DE CONTRATO","SINDICALIZADO","CÓDIGO TIPO DE JORNADA","CÓDIGO TIPO DE RÉGIMEN","NÚMERO EMPLEADO","DEPARTAMENTO","PUESTO","CÓDIGO RIESGO PUESTO","CÓDIGO PERIODICIDAD DEL PAGO","CÓDIGO BANCO","CUENTA BANCARIA","SALARIO BASE","SALARIO DIARIO INTEGRADO","CÓDIGO ENTIDAD FEDERATIVA","MAIL 1","MAIL 2","RFC DE QUIEN SUBCONTRATA","PORCENTAJE DEL TIEMPO QUE PRESTÓ SUS SERVICIOS","RFC DE QUIEN SUBCONTRATA","PORCENTAJE DEL TIEMPO QUE PRESTÓ SUS SERVICIOS","RFC DE QUIEN SUBCONTRATA","PORCENTAJE DEL TIEMPO QUE PRESTÓ SUS SERVICIOS","RFC DE QUIEN SUBCONTRATA","PORCENTAJE DEL TIEMPO QUE PRESTÓ SUS SERVICIOS","RFC DE QUIEN SUBCONTRATA","PORCENTAJE DEL TIEMPO QUE PRESTÓ SUS SERVICIOS","PERCEPCIÓN CÓDIGO SAT","PERCEPCIÓN CÓDIGO INTERNO","PERCEPCIÓN CONCEPTO ","PERCEPCIÓN IMPORTE GRAVADO","PERCEPCIÓN IMPORTE EXCENTO","PERCEPCIÓN CÓDIGO SAT","PERCEPCIÓN CÓDIGO INTERNO","PERCEPCIÓN CONCEPTO ","PERCEPCIÓN IMPORTE GRAVADO","PERCEPCIÓN IMPORTE EXCENTO","PERCEPCIÓN CÓDIGO SAT","PERCEPCIÓN CÓDIGO INTERNO","PERCEPCIÓN CONCEPTO ","PERCEPCIÓN IMPORTE GRAVADO","PERCEPCIÓN IMPORTE EXCENTO","PERCEPCIÓN CÓDIGO SAT","PERCEPCIÓN CÓDIGO INTERNO","PERCEPCIÓN CONCEPTO ","PERCEPCIÓN IMPORTE GRAVADO","PERCEPCIÓN IMPORTE EXCENTO","PERCEPCIÓN CÓDIGO SAT","PERCEPCIÓN CÓDIGO INTERNO","PERCEPCIÓN CONCEPTO ","PERCEPCIÓN IMPORTE GRAVADO","PERCEPCIÓN IMPORTE EXCENTO","PERCEPCIÓN CÓDIGO SAT","PERCEPCIÓN CÓDIGO INTERNO","PERCEPCIÓN CONCEPTO ","PERCEPCIÓN IMPORTE GRAVADO","PERCEPCIÓN IMPORTE EXCENTO","PERCEPCIÓN CÓDIGO SAT","PERCEPCIÓN CÓDIGO INTERNO","PERCEPCIÓN CONCEPTO ","PERCEPCIÓN IMPORTE GRAVADO","PERCEPCIÓN IMPORTE EXCENTO","PERCEPCIÓN CÓDIGO SAT","PERCEPCIÓN CÓDIGO INTERNO","PERCEPCIÓN CONCEPTO ","PERCEPCIÓN IMPORTE GRAVADO","PERCEPCIÓN IMPORTE EXCENTO","PERCEPCIÓN CÓDIGO SAT","PERCEPCIÓN CÓDIGO INTERNO","PERCEPCIÓN CONCEPTO ","PERCEPCIÓN IMPORTE GRAVADO","PERCEPCIÓN IMPORTE EXCENTO","PERCEPCIÓN CÓDIGO SAT","PERCEPCIÓN CÓDIGO INTERNO","PERCEPCIÓN CONCEPTO ","PERCEPCIÓN IMPORTE GRAVADO","PERCEPCIÓN IMPORTE EXCENTO","PERCEPCIÓN CÓDIGO SAT","PERCEPCIÓN CÓDIGO INTERNO","PERCEPCIÓN CONCEPTO ","PERCEPCIÓN IMPORTE GRAVADO","PERCEPCIÓN IMPORTE EXCENTO","PERCEPCIÓN CÓDIGO SAT","PERCEPCIÓN CÓDIGO INTERNO","PERCEPCIÓN CONCEPTO ","PERCEPCIÓN IMPORTE GRAVADO","PERCEPCIÓN IMPORTE EXCENTO","DEDUCCIÓN CÓDIGO  SAT","DEDUCCIÓN CÓDIGO INTERNO","DEDUCCIÓN CONCEPTO","DEDUCCIÓN IMPORTE","DEDUCCIÓN CÓDIGO  SAT","DEDUCCIÓN CÓDIGO INTERNO","DEDUCCIÓN CONCEPTO","DEDUCCIÓN IMPORTE","DEDUCCIÓN CÓDIGO  SAT","DEDUCCIÓN CÓDIGO INTERNO","DEDUCCIÓN CONCEPTO","DEDUCCIÓN IMPORTE","DEDUCCIÓN CÓDIGO  SAT","DEDUCCIÓN CÓDIGO INTERNO","DEDUCCIÓN CONCEPTO","DEDUCCIÓN IMPORTE","DEDUCCIÓN CÓDIGO  SAT","DEDUCCIÓN CÓDIGO INTERNO","DEDUCCIÓN CONCEPTO","DEDUCCIÓN IMPORTE","DEDUCCIÓN CÓDIGO  SAT","DEDUCCIÓN CÓDIGO INTERNO","DEDUCCIÓN CONCEPTO","DEDUCCIÓN IMPORTE","DEDUCCIÓN CÓDIGO  SAT","DEDUCCIÓN CÓDIGO INTERNO","DEDUCCIÓN CONCEPTO","DEDUCCIÓN IMPORTE","DEDUCCIÓN CÓDIGO  SAT","DEDUCCIÓN CÓDIGO INTERNO","DEDUCCIÓN CONCEPTO","DEDUCCIÓN IMPORTE","DEDUCCIÓN CÓDIGO  SAT","DEDUCCIÓN CÓDIGO INTERNO","DEDUCCIÓN CONCEPTO","DEDUCCIÓN IMPORTE","DEDUCCIÓN CÓDIGO  SAT","DEDUCCIÓN CÓDIGO INTERNO","DEDUCCIÓN CONCEPTO","DEDUCCIÓN IMPORTE","DEDUCCIÓN CÓDIGO  SAT","DEDUCCIÓN CÓDIGO INTERNO","DEDUCCIÓN CONCEPTO","DEDUCCIÓN IMPORTE","DEDUCCIÓN CÓDIGO  SAT","DEDUCCIÓN CÓDIGO INTERNO","DEDUCCIÓN CONCEPTO","DEDUCCIÓN IMPORTE","OTRO PAGO CÓDIGO SAT","OTRO PAGO CÓDIGO INTERNO","OTRO PAGO CONCEPTO","OTRO PAGO IMPORTE","OTRO PAGO CÓDIGO SAT","OTRO PAGO CÓDIGO INTERNO","OTRO PAGO CONCEPTO","OTRO PAGO IMPORTE","OTRO PAGO CÓDIGO SAT","OTRO PAGO CÓDIGO INTERNO","OTRO PAGO CONCEPTO","OTRO PAGO IMPORTE","OTRO PAGO CÓDIGO SAT","OTRO PAGO CÓDIGO INTERNO","OTRO PAGO CONCEPTO","OTRO PAGO IMPORTE","OTRO PAGO CÓDIGO SAT","OTRO PAGO CÓDIGO INTERNO","OTRO PAGO CONCEPTO","OTRO PAGO IMPORTE","HORAS EXTRAS CÓDIGO INTERNO","HORAS EXTRAS Nº DIAS ","HORAS EXTRAS CÓDIGO SAT","HORAS EXTRAS Nº HORAS","HORAS EXTRAS IMPORTE GRAVADO","HORAS EXTRAS IMPORTE EXCENTO","HORAS EXTRAS CÓDIGO INTERNO","HORAS EXTRAS Nº DIAS ","HORAS EXTRAS CÓDIGO SAT","HORAS EXTRAS Nº HORAS","HORAS EXTRAS IMPORTE GRAVADO","HORAS EXTRAS IMPORTE EXCENTO","INCAPACIDAD CÓDIGO INTERNO","INCAPACIDAD Nº DIAS","INCAPACIDAD CÓDIGO SAT","INCAPACIDAD IMPORTE","INCAPACIDAD CÓDIGO INTERNO","INCAPACIDAD Nº DIAS","INCAPACIDAD CÓDIGO SAT","INCAPACIDAD IMPORTE","INCAPACIDAD CÓDIGO INTERNO","INCAPACIDAD Nº DIAS","INCAPACIDAD CÓDIGO SAT","INCAPACIDAD IMPORTE","SEPARACION CÓDIGO INTERNO","SEPARACION TOTAL PAGADO","SEPARACION NÚMERO AÑOS DE SERVICIO","SEPARACION ÚLTIMO SUELDO MENSUAL","SEPARACION INGRESO ACUMULABLE","SEPARACION INGRESO NO ACUMULABLE"]
[{"$f":"RFCEMISOR","v":"AAA010101AAA"},{"$f":"CURPEMISOR","v":0},{"$f":"REGISTROPATRONAL","v":"A9990009900"},{"$f":"REGIMEN_FISCAL","v":"626|Régimen Simplificado de Confianza"},{"$f":"CODIGO_POSTAL","v":"06000"},null,{"$f":"VERSION","v":1.2},{"$f":"TIPO_NOMINA","v":"O|Nómina ordinaria"},{"$f":"VLOOKUP(PERIODONOMINA,PERIOD_NOM,2,0)","v":"2022-11-30"},{"$f":"VLOOKUP(PERIODONOMINA,PERIOD_NOM,3,0)","v":"2022-11-16"},{"$f":"VLOOKUP(PERIODONOMINA,PERIOD_NOM,4,0)","v":"2022-11-30"},{"$f":"IF(VLOOKUP($Y3,CatalogoEmpleados,26,0)=0,\"\",VLOOKUP($Y3,CatalogoEmpleados,26,0))","v":""},{"$f":"PERIODONOMINA","v":1},{"$f":"IF(VLOOKUP($Y3,CatalogoEmpleados,2,0)=0,\"\",VLOOKUP($Y3,CatalogoEmpleados,2,0))","v":"XAXX010101XXX"},{"$f":"CONCATENATE(IF(VLOOKUP($Y3,CatalogoEmpleados,3,0)=0,\"\",VLOOKUP($Y3,CatalogoEmpleados,3,0)),\" \",IF(VLOOKUP($Y3,CatalogoEmpleados,4,0)=0,\"\",VLOOKUP($Y3,CatalogoEmpleados,4,0)),\" \", IF(VLOOKUP($Y3,CatalogoEmpleados,5,0)=0,\"\",VLOOKUP($Y3,CatalogoEmpleados,5,0)))","v":"  "},{"$f":"IF(VLOOKUP($Y3,CatalogoEmpleados,6,0)=0,\"\",VLOOKUP($Y3,CatalogoEmpleados,6,0))","v":""},{"$f":"IF(VLOOKUP($Y3,CatalogoEmpleados,8,0)=0,\"\",VLOOKUP($Y3,CatalogoEmpleados,8,0))","v":""},{"$f":"IF(VLOOKUP($Y3,CatalogoEmpleados,7,0)=0,\"\",VLOOKUP($Y3,CatalogoEmpleados,7,0))","v":""},{"$f":"IF(VLOOKUP($Y3,CatalogoEmpleados,9,0)=0,\"\",VLOOKUP($Y3,CatalogoEmpleados,9,0))","v":"2019-04-16"},{"$f":"IF(VLOOKUP($Y3,CatalogoEmpleados,10,0)=0,\"\",VLOOKUP($Y3,CatalogoEmpleados,10,0))","v":189},{"$f":"IF(VLOOKUP($Y3,CatalogoEmpleados,11,0)=0,\"\",VLOOKUP($Y3,CatalogoEmpleados,11,0))","v":"01|Contrato de trabajo por tiempo indeterminado"},{"$f":"IF(VLOOKUP($Y3,CatalogoEmpleados,12,0)=0,\"\",VLOOKUP($Y3,CatalogoEmpleados,12,0))","v":"No"},{"$f":"IF(VLOOKUP($Y3,CatalogoEmpleados,13,0)=0,\"\",VLOOKUP($Y3,CatalogoEmpleados,13,0))","v":"01|Diurna"},{"$f":"IF(VLOOKUP($Y3,CatalogoEmpleados,14,0)=0,\"\",VLOOKUP($Y3,CatalogoEmpleados,14,0))","v":"02|Sueldos"},1,{"$f":"IF(VLOOKUP($Y3,CatalogoEmpleados,15,0)=0,\"\",VLOOKUP($Y3,CatalogoEmpleados,15,0))","v":""},{"$f":"IF(VLOOKUP($Y3,CatalogoEmpleados,16,0)=0,\"\",VLOOKUP($Y3,CatalogoEmpleados,16,0))","v":"Auxiliar de recepcion"},{"$f":"IF(VLOOKUP($Y3,CatalogoEmpleados,17,0)=0,\"\",VLOOKUP($Y3,CatalogoEmpleados,17,0))","v":"1|Clase I"},{"$f":"IF(VLOOKUP($Y3,CatalogoEmpleados,18,0)=0,\"\",VLOOKUP($Y3,CatalogoEmpleados,18,0))","v":"03|Catorcenal"},{"$f":"IF(VLOOKUP($Y3,CatalogoEmpleados,19,0)=0,\"\",VLOOKUP($Y3,CatalogoEmpleados,19,0))","v":""},{"$f":"IF(VLOOKUP($Y3,CatalogoEmpleados,20,0)=0,\"\",VLOOKUP($Y3,CatalogoEmpleados,20,0))","v":""},{"$f":"IF(VLOOKUP($Y3,CatalogoEmpleados,21,0)=0,\"\",VLOOKUP($Y3,CatalogoEmpleados,21,0))","v":300},{"$f":"IF(VLOOKUP($Y3,CatalogoEmpleados,22,0)=0,\"\",VLOOKUP($Y3,CatalogoEmpleados,22,0))","v":200},{"$f":"IF(VLOOKUP($Y3,CatalogoEmpleados,23,0)=0,\"\",VLOOKUP($Y3,CatalogoEmpleados,23,0))","v":""},{"$f":"IF(VLOOKUP($Y3,CatalogoEmpleados,24,0)=0,\"\",VLOOKUP($Y3,CatalogoEmpleados,24,0))","v":"ejemplo@gmail.com"},{"$f":"IF(VLOOKUP($Y3,CatalogoEmpleados,25,0)=0,\"\",VLOOKUP($Y3,CatalogoEmpleados,25,0))","v":""},null,null,null,null,null,null,null,null,null,null,null,{"$f":"IF(ISERROR(VLOOKUP($AU3,PERCEPCIONES,3,0)),\"\",VLOOKUP($AU3,PERCEPCIONES,3,0))","v":""},{"$f":"IF(ISERROR(VLOOKUP($AU3,PERCEPCIONES,2,0)),\"\",VLOOKUP($AU3,PERCEPCIONES,2,0))","v":""},null,null,null,{"$f":"IF(ISERROR(VLOOKUP($AZ3,PERCEPCIONES,3,0)),\"\",VLOOKUP($AZ3,PERCEPCIONES,3,0))","v":""},{"$f":"IF(ISERROR(VLOOKUP($AZ3,PERCEPCIONES,2,0)),\"\",VLOOKUP($AZ3,PERCEPCIONES,2,0))","v":""},null,null,null,{"$f":"IF(ISERROR(VLOOKUP($BE3,PERCEPCIONES,3,0)),\"\",VLOOKUP($BE3,PERCEPCIONES,3,0))","v":""},{"$f":"IF(ISERROR(VLOOKUP($BE3,PERCEPCIONES,2,0)),\"\",VLOOKUP($BE3,PERCEPCIONES,2,0))","v":""},null,null,null,{"$f":"IF(ISERROR(VLOOKUP($BJ3,PERCEPCIONES,3,0)),\"\",VLOOKUP($BJ3,PERCEPCIONES,3,0))","v":""},{"$f":"IF(ISERROR(VLOOKUP($BJ3,PERCEPCIONES,2,0)),\"\",VLOOKUP($BJ3,PERCEPCIONES,2,0))","v":""},null,null,null,{"$f":"IF(ISERROR(VLOOKUP($BO3,PERCEPCIONES,3,0)),\"\",VLOOKUP($BO3,PERCEPCIONES,3,0))","v":""},{"$f":"IF(ISERROR(VLOOKUP($BO3,PERCEPCIONES,2,0)),\"\",VLOOKUP($BO3,PERCEPCIONES,2,0))","v":""},null,null,null,{"$f":"IF(ISERROR(VLOOKUP($BT3,PERCEPCIONES,3,0)),\"\",VLOOKUP($BT3,PERCEPCIONES,3,0))","v":""},{"$f":"IF(ISERROR(VLOOKUP($BT3,PERCEPCIONES,2,0)),\"\",VLOOKUP($BT3,PERCEPCIONES,2,0))","v":""},null,null,null,{"$f":"IF(ISERROR(VLOOKUP($BY3,PERCEPCIONES,3,0)),\"\",VLOOKUP($BY3,PERCEPCIONES,3,0))","v":""},{"$f":"IF(ISERROR(VLOOKUP($BY3,PERCEPCIONES,2,0)),\"\",VLOOKUP($BY3,PERCEPCIONES,2,0))","v":""},null,null,null,{"$f":"IF(ISERROR(VLOOKUP($CD3,PERCEPCIONES,3,0)),\"\",VLOOKUP($CD3,PERCEPCIONES,3,0))","v":""},{"$f":"IF(ISERROR(VLOOKUP($CD3,PERCEPCIONES,2,0)),\"\",VLOOKUP($CD3,PERCEPCIONES,2,0))","v":""},null,null,null,{"$f":"IF(ISERROR(VLOOKUP($CI3,PERCEPCIONES,3,0)),\"\",VLOOKUP($CI3,PERCEPCIONES,3,0))","v":""},{"$f":"IF(ISERROR(VLOOKUP($CI3,PERCEPCIONES,2,0)),\"\",VLOOKUP($CI3,PERCEPCIONES,2,0))","v":""},null,null,null,{"$f":"IF(ISERROR(VLOOKUP($CN3,PERCEPCIONES,3,0)),\"\",VLOOKUP($CN3,PERCEPCIONES,3,0))","v":""},{"$f":"IF(ISERROR(VLOOKUP($CN3,PERCEPCIONES,2,0)),\"\",VLOOKUP($CN3,PERCEPCIONES,2,0))","v":""},null,null,null,{"$f":"IF(ISERROR(VLOOKUP($CS3,PERCEPCIONES,3,0)),\"\",VLOOKUP($CS3,PERCEPCIONES,3,0))","v":""},{"$f":"IF(ISERROR(VLOOKUP($CS3,PERCEPCIONES,2,0)),\"\",VLOOKUP($CS3,PERCEPCIONES,2,0))","v":""},null,null,null,{"$f":"IF(ISERROR(VLOOKUP($CX3,PERCEPCIONES,3,0)),\"\",VLOOKUP($CX3,PERCEPCIONES,3,0))","v":""},{"$f":"IF(ISERROR(VLOOKUP($CX3,PERCEPCIONES,2,0)),\"\",VLOOKUP($CX3,PERCEPCIONES,2,0))","v":""},null,null,null,{"$f":"IF(ISERROR(VLOOKUP($DC3,DEDUCCIONES,3,0)),\"\",VLOOKUP($DC3,DEDUCCIONES,3,0))","v":""},{"$f":"IF(ISERROR(VLOOKUP($DC3,DEDUCCIONES,2,0)),\"\",VLOOKUP($DC3,DEDUCCIONES,2,0))","v":""},null,null,{"$f":"IF(ISERROR(VLOOKUP($DG3,DEDUCCIONES,3,0)),\"\",VLOOKUP($DG3,DEDUCCIONES,3,0))","v":""},{"$f":"IF(ISERROR(VLOOKUP($DG3,DEDUCCIONES,2,0)),\"\",VLOOKUP($DG3,DEDUCCIONES,2,0))","v":""},null,null,{"$f":"IF(ISERROR(VLOOKUP($DK3,DEDUCCIONES,3,0)),\"\",VLOOKUP($DK3,DEDUCCIONES,3,0))","v":""},{"$f":"IF(ISERROR(VLOOKUP($DK3,DEDUCCIONES,2,0)),\"\",VLOOKUP($DK3,DEDUCCIONES,2,0))","v":""},null,null,{"$f":"IF(ISERROR(VLOOKUP($DO3,DEDUCCIONES,3,0)),\"\",VLOOKUP($DO3,DEDUCCIONES,3,0))","v":""},{"$f":"IF(ISERROR(VLOOKUP($DO3,DEDUCCIONES,2,0)),\"\",VLOOKUP($DO3,DEDUCCIONES,2,0))","v":""},null,null,{"$f":"IF(ISERROR(VLOOKUP($DS3,DEDUCCIONES,3,0)),\"\",VLOOKUP($DS3,DEDUCCIONES,3,0))","v":""},{"$f":"IF(ISERROR(VLOOKUP($DS3,DEDUCCIONES,2,0)),\"\",VLOOKUP($DS3,DEDUCCIONES,2,0))","v":""},null,null,{"$f":"IF(ISERROR(VLOOKUP($DW3,DEDUCCIONES,3,0)),\"\",VLOOKUP($DW3,DEDUCCIONES,3,0))","v":""},{"$f":"IF(ISERROR(VLOOKUP($DW3,DEDUCCIONES,2,0)),\"\",VLOOKUP($DW3,DEDUCCIONES,2,0))","v":""},null,null,{"$f":"IF(ISERROR(VLOOKUP($EA3,DEDUCCIONES,3,0)),\"\",VLOOKUP($EA3,DEDUCCIONES,3,0))","v":""},{"$f":"IF(ISERROR(VLOOKUP($EA3,DEDUCCIONES,2,0)),\"\",VLOOKUP($EA3,DEDUCCIONES,2,0))","v":""},null,null,{"$f":"IF(ISERROR(VLOOKUP($EE3,DEDUCCIONES,3,0)),\"\",VLOOKUP($EE3,DEDUCCIONES,3,0))","v":""},{"$f":"IF(ISERROR(VLOOKUP($EE3,DEDUCCIONES,2,0)),\"\",VLOOKUP($EE3,DEDUCCIONES,2,0))","v":""},null,null,{"$f":"IF(ISERROR(VLOOKUP($EI3,DEDUCCIONES,3,0)),\"\",VLOOKUP($EI3,DEDUCCIONES,3,0))","v":""},{"$f":"IF(ISERROR(VLOOKUP($EI3,DEDUCCIONES,2,0)),\"\",VLOOKUP($EI3,DEDUCCIONES,2,0))","v":""},null,null,{"$f":"IF(ISERROR(VLOOKUP($EM3,DEDUCCIONES,3,0)),\"\",VLOOKUP($EM3,DEDUCCIONES,3,0))","v":""},{"$f":"IF(ISERROR(VLOOKUP($EM3,DEDUCCIONES,2,0)),\"\",VLOOKUP($EM3,DEDUCCIONES,2,0))","v":""},null,null,{"$f":"IF(ISERROR(VLOOKUP($EQ3,DEDUCCIONES,3,0)),\"\",VLOOKUP($EQ3,DEDUCCIONES,3,0))","v":""},{"$f":"IF(ISERROR(VLOOKUP($EQ3,DEDUCCIONES,2,0)),\"\",VLOOKUP($EQ3,DEDUCCIONES,2,0))","v":""},null,null,{"$f":"IF(ISERROR(VLOOKUP($EU3,DEDUCCIONES,3,0)),\"\",VLOOKUP($EU3,DEDUCCIONES,3,0))","v":""},{"$f":"IF(ISERROR(VLOOKUP($EU3,DEDUCCIONES,2,0)),\"\",VLOOKUP($EU3,DEDUCCIONES,2,0))","v":""},null,null,{"$f":"IF(ISERROR(VLOOKUP($EY3,COD_OTRO_PAGO,3,0)),\"\",VLOOKUP($EY3,COD_OTRO_PAGO,3,0))","v":""},{"$f":"IF(ISERROR(VLOOKUP($EY3,COD_OTRO_PAGO,2,0)),\"\",VLOOKUP($EY3,COD_OTRO_PAGO,2,0))","v":""},null,null,{"$f":"IF(ISERROR(VLOOKUP($FC3,COD_OTRO_PAGO,3,0)),\"\",VLOOKUP($FC3,COD_OTRO_PAGO,3,0))","v":""},{"$f":"IF(ISERROR(VLOOKUP($FC3,COD_OTRO_PAGO,2,0)),\"\",VLOOKUP($FC3,COD_OTRO_PAGO,2,0))","v":""},null,null,{"$f":"IF(ISERROR(VLOOKUP($FG3,COD_OTRO_PAGO,3,0)),\"\",VLOOKUP($FG3,COD_OTRO_PAGO,3,0))","v":""},{"$f":"IF(ISERROR(VLOOKUP($FG3,COD_OTRO_PAGO,2,0)),\"\",VLOOKUP($FG3,COD_OTRO_PAGO,2,0))","v":""},null,null,{"$f":"IF(ISERROR(VLOOKUP($FK3,COD_OTRO_PAGO,3,0)),\"\",VLOOKUP($FK3,COD_OTRO_PAGO,3,0))","v":""},{"$f":"IF(ISERROR(VLOOKUP($FK3,COD_OTRO_PAGO,2,0)),\"\",VLOOKUP($FK3,COD_OTRO_PAGO,2,0))","v":""},null,null,{"$f":"IF(ISERROR(VLOOKUP($FO3,COD_OTRO_PAGO,3,0)),\"\",VLOOKUP($FO3,COD_OTRO_PAGO,3,0))","v":""},{"$f":"IF(ISERROR(VLOOKUP($FO3,COD_OTRO_PAGO,2,0)),\"\",VLOOKUP($FO3,COD_OTRO_PAGO,2,0))","v":""},null,{"$f":"IF(ISERROR(VLOOKUP($FU3,COD_HORAS_EXTRA,3,0)),\"\",VLOOKUP($FU3,COD_HORAS_EXTRA,3,0))","v":""},null,null,null,null,null,{"$f":"IF(ISERROR(VLOOKUP($GA3,COD_HORAS_EXTRA,3,0)),\"\",VLOOKUP($GA3,COD_HORAS_EXTRA,3,0))","v":""},null,null,null,null,null,{"$f":"IF(ISERROR(VLOOKUP($GG3,COD_TIP_INCA,3,0)),\"\",VLOOKUP($GG3,COD_TIP_INCA,3,0))","v":""},null,null,null,{"$f":"IF(ISERROR(VLOOKUP($GK3,COD_TIP_INCA,3,0)),\"\",VLOOKUP($GK3,COD_TIP_INCA,3,0))","v":""},null,null,null,{"$f":"IF(ISERROR(VLOOKUP($GO3,COD_TIP_INCA,3,0)),\"\",VLOOKUP($GO3,COD_TIP_INCA,3,0))","v":""}]
[{"$f":"RFCEMISOR","v":"AAA010101AAA"},{"$f":"CURPEMISOR","v":0},{"$f":"REGISTROPATRONAL","v":"A9990009900"},{"$f":"REGIMEN_FISCAL","v":"626|Régimen Simplificado de Confianza"},{"$f":"CODIGO_POSTAL","v":"06000"},null,{"$f":"VERSION","v":1.2},{"$f":"TIPO_NOMINA","v":"O|Nómina ordinaria"},{"$f":"VLOOKUP(PERIODONOMINA,PERIOD_NOM,2,0)","v":"2022-11-30"},{"$f":"VLOOKUP(PERIODONOMINA,PERIOD_NOM,3,0)","v":"2022-11-16"},{"$f":"VLOOKUP(PERIODONOMINA,PERIOD_NOM,4,0)","v":"2022-11-30"},{"$f":"IF(VLOOKUP($Y4,CatalogoEmpleados,26,0)=0,\"\",VLOOKUP($Y4,CatalogoEmpleados,26,0))","v":""},{"$f":"PERIODONOMINA","v":1},{"$f":"IF(VLOOKUP($Y4,CatalogoEmpleados,2,0)=0,\"\",VLOOKUP($Y4,CatalogoEmpleados,2,0))","v":"XAXX010101XXX"},{"$f":"CONCATENATE(IF(VLOOKUP($Y4,CatalogoEmpleados,3,0)=0,\"\",VLOOKUP($Y4,CatalogoEmpleados,3,0)),\" \",IF(VLOOKUP($Y4,CatalogoEmpleados,4,0)=0,\"\",VLOOKUP($Y4,CatalogoEmpleados,4,0)),\" \", IF(VLOOKUP($Y4,CatalogoEmpleados,5,0)=0,\"\",VLOOKUP($Y4,CatalogoEmpleados,5,0)))","v":"  "},{"$f":"IF(VLOOKUP($Y4,CatalogoEmpleados,6,0)=0,\"\",VLOOKUP($Y4,CatalogoEmpleados,6,0))","v":""},{"$f":"IF(VLOOKUP($Y4,CatalogoEmpleados,8,0)=0,\"\",VLOOKUP($Y4,CatalogoEmpleados,8,0))","v":""},{"$f":"IF(VLOOKUP($Y4,CatalogoEmpleados,7,0)=0,\"\",VLOOKUP($Y4,CatalogoEmpleados,7,0))","v":""},{"$f":"IF(VLOOKUP($Y4,CatalogoEmpleados,9,0)=0,\"\",VLOOKUP($Y4,CatalogoEmpleados,9,0))","v":"2022-10-01"},{"$f":"IF(VLOOKUP($Y4,CatalogoEmpleados,10,0)=0,\"\",VLOOKUP($Y4,CatalogoEmpleados,10,0))","v":8},{"$f":"IF(VLOOKUP($Y4,CatalogoEmpleados,11,0)=0,\"\",VLOOKUP($Y4,CatalogoEmpleados,11,0))","v":"01|Contrato de trabajo por tiempo indeterminado"},{"$f":"IF(VLOOKUP($Y4,CatalogoEmpleados,12,0)=0,\"\",VLOOKUP($Y4,CatalogoEmpleados,12,0))","v":"No"},{"$f":"IF(VLOOKUP($Y4,CatalogoEmpleados,13,0)=0,\"\",VLOOKUP($Y4,CatalogoEmpleados,13,0))","v":"01|Diurna"},{"$f":"IF(VLOOKUP($Y4,CatalogoEmpleados,14,0)=0,\"\",VLOOKUP($Y4,CatalogoEmpleados,14,0))","v":"02|Sueldos"},2,{"$f":"IF(VLOOKUP($Y4,CatalogoEmpleados,15,0)=0,\"\",VLOOKUP($Y4,CatalogoEmpleados,15,0))","v":""},{"$f":"IF(VLOOKUP($Y4,CatalogoEmpleados,16,0)=0,\"\",VLOOKUP($Y4,CatalogoEmpleados,16,0))","v":"Cajera"},{"$f":"IF(VLOOKUP($Y4,CatalogoEmpleados,17,0)=0,\"\",VLOOKUP($Y4,CatalogoEmpleados,17,0))","v":"1|Clase I"},{"$f":"IF(VLOOKUP($Y4,CatalogoEmpleados,18,0)=0,\"\",VLOOKUP($Y4,CatalogoEmpleados,18,0))","v":"03|Catorcenal"},{"$f":"IF(VLOOKUP($Y4,CatalogoEmpleados,19,0)=0,\"\",VLOOKUP($Y4,CatalogoEmpleados,19,0))","v":""},{"$f":"IF(VLOOKUP($Y4,CatalogoEmpleados,20,0)=0,\"\",VLOOKUP($Y4,CatalogoEmpleados,20,0))","v":""},{"$f":"IF(VLOOKUP($Y4,CatalogoEmpleados,21,0)=0,\"\",VLOOKUP($Y4,CatalogoEmpleados,21,0))","v":""},{"$f":"IF(VLOOKUP($Y4,CatalogoEmpleados,22,0)=0,\"\",VLOOKUP($Y4,CatalogoEmpleados,22,0))","v":""},{"$f":"IF(VLOOKUP($Y4,CatalogoEmpleados,23,0)=0,\"\",VLOOKUP($Y4,CatalogoEmpleados,23,0))","v":""},{"$f":"IF(VLOOKUP($Y4,CatalogoEmpleados,24,0)=0,\"\",VLOOKUP($Y4,CatalogoEmpleados,24,0))","v":""},{"$f":"IF(VLOOKUP($Y4,CatalogoEmpleados,25,0)=0,\"\",VLOOKUP($Y4,CatalogoEmpleados,25,0))","v":""},null,null,null,null,null,null,null,null,null,null,null,"","",null,null,null,"","",null,null,null,"","",null,null,null,"","",null,null,null,"","",null,null,null,"","",null,null,null,"","",null,null,null,"","",null,null,null,"","",null,null,null,"","",null,null,null,"","",null,null,null,"","",null,null,null,"","",null,null,"","",null,null,"","",null,null,"","",null,null,"","",null,null,"","",null,null,"","",null,null,"","",null,null,"","",null,null,"","",null,null,"","",null,null,"","",null,null,"","",null,null,"","",null,null,"","",null,null,"","",null,null,"","",null,"",null,null,null,null,null,"",null,null,null,null,null,"",null,null,null,"",null,null,null,""]

{"sheet":"Plantilla (Original)","index":6,"n_rows":83,"n_cols":204,"rows_kept":83,"cut":false,"hidden":true,"merged":[]}
[]
["RFC","CURP","REGISTRO PATRONAL","RÉGIMEN FISCAL","CÓDIGO POSTAL","FOLIO","VERSION ","CÓDIGO TIPO NÓMINA","FECHA DE PAGO","FECHA INICIAL PERIODO DE NÓMINA","FECHA FINAL PERIODO DE NÓMINA","NÚMERO DE DÍAS PAGADOS","NÚMERO DE NÓMINA","RECEPTOR RFC","RECEPTOR NOMBRE","RECEPTOR CURP","NÚMERO SEGURIDAD SOCIAL","RECEPTOR CÓDIGO POSTAL","FECHA INICIO RELACIÓN LABORAL","ANTIGÜEDAD","CÓDIGO TIPO DE CONTRATO","SINDICALIZADO","CÓDIGO TIPO DE JORNADA","CÓDIGO TIPO DE RÉGIMEN","NÚMERO EMPLEADO","DEPARTAMENTO","PUESTO","CÓDIGO RIESGO PUESTO","CÓDIGO PERIODICIDAD DEL PAGO","CÓDIGO BANCO","CUENTA BANCARIA","SALARIO BASE","SALARIO DIARIO INTEGRADO","CÓDIGO ENTIDAD FEDERATIVA","MAIL 1","MAIL 2","RFC DE QUIEN SUBCONTRATA","PORCENTAJE DEL TIEMPO QUE PRESTÓ SUS SERVICIOS","RFC DE QUIEN SUBCONTRATA","PORCENTAJE DEL TIEMPO QUE PRESTÓ SUS SERVICIOS","RFC DE QUIEN SUBCONTRATA","PORCENTAJE DEL TIEMPO QUE PRESTÓ SUS SERVICIOS","RFC DE QUIEN SUBCONTRATA","PORCENTAJE DEL TIEMPO QUE PRESTÓ SUS SERVICIOS","RFC DE QUIEN SUBCONTRATA","PORCENTAJE DEL TIEMPO QUE PRESTÓ SUS SERVICIOS","PERCEPCIÓN CÓDIGO SAT","PERCEPCIÓN CÓDIGO INTERNO","PERCEPCIÓN CONCEPTO ","PERCEPCIÓN IMPORTE GRAVADO","PERCEPCIÓN IMPORTE EXCENTO","PERCEPCIÓN CÓDIGO SAT","PERCEPCIÓN CÓDIGO INTERNO","PERCEPCIÓN CONCEPTO ","PERCEPCIÓN IMPORTE GRAVADO","PERCEPCIÓN IMPORTE EXCENTO","PERCEPCIÓN CÓDIGO SAT","PERCEPCIÓN CÓDIGO INTERNO","PERCEPCIÓN CONCEPTO ","PERCEPCIÓN IMPORTE GRAVADO","PERCEPCIÓN IMPORTE EXCENTO","PERCEPCIÓN CÓDIGO SAT","PERCEPCIÓN CÓDIGO INTERNO","PERCEPCIÓN CONCEPTO ","PERCEPCIÓN IMPORTE GRAVADO","PERCEPCIÓN IMPORTE EXCENTO","PERCEPCIÓN CÓDIGO SAT","PERCEPCIÓN CÓDIGO INTERNO","PERCEPCIÓN CONCEPTO ","PERCEPCIÓN IMPORTE GRAVADO","PERCEPCIÓN IMPORTE EXCENTO","PERCEPCIÓN CÓDIGO SAT","PERCEPCIÓN CÓDIGO INTERNO","PERCEPCIÓN CONCEPTO ","PERCEPCIÓN IMPORTE GRAVADO","PERCEPCIÓN IMPORTE EXCENTO","PERCEPCIÓN CÓDIGO SAT","PERCEPCIÓN CÓDIGO INTERNO","PERCEPCIÓN CONCEPTO ","PERCEPCIÓN IMPORTE GRAVADO","PERCEPCIÓN IMPORTE EXCENTO","PERCEPCIÓN CÓDIGO SAT","PERCEPCIÓN CÓDIGO INTERNO","PERCEPCIÓN CONCEPTO ","PERCEPCIÓN IMPORTE GRAVADO","PERCEPCIÓN IMPORTE EXCENTO","PERCEPCIÓN CÓDIGO SAT","PERCEPCIÓN CÓDIGO INTERNO","PERCEPCIÓN CONCEPTO ","PERCEPCIÓN IMPORTE GRAVADO","PERCEPCIÓN IMPORTE EXCENTO","PERCEPCIÓN CÓDIGO SAT","PERCEPCIÓN CÓDIGO INTERNO","PERCEPCIÓN CONCEPTO ","PERCEPCIÓN IMPORTE GRAVADO","PERCEPCIÓN IMPORTE EXCENTO","PERCEPCIÓN CÓDIGO SAT","PERCEPCIÓN CÓDIGO INTERNO","PERCEPCIÓN CONCEPTO ","PERCEPCIÓN IMPORTE GRAVADO","PERCEPCIÓN IMPORTE EXCENTO","PERCEPCIÓN CÓDIGO SAT","PERCEPCIÓN CÓDIGO INTERNO","PERCEPCIÓN CONCEPTO ","PERCEPCIÓN IMPORTE GRAVADO","PERCEPCIÓN IMPORTE EXCENTO","DEDUCCIÓN CÓDIGO  SAT","DEDUCCIÓN CÓDIGO INTERNO","DEDUCCIÓN CONCEPTO","DEDUCCIÓN IMPORTE","DEDUCCIÓN CÓDIGO  SAT","DEDUCCIÓN CÓDIGO INTERNO","DEDUCCIÓN CONCEPTO","DEDUCCIÓN IMPORTE","DEDUCCIÓN CÓDIGO  SAT","DEDUCCIÓN CÓDIGO INTERNO","DEDUCCIÓN CONCEPTO","DEDUCCIÓN IMPORTE","DEDUCCIÓN CÓDIGO  SAT","DEDUCCIÓN CÓDIGO INTERNO","DEDUCCIÓN CONCEPTO","DEDUCCIÓN IMPORTE","DEDUCCIÓN CÓDIGO  SAT","DEDUCCIÓN CÓDIGO INTERNO","DEDUCCIÓN CONCEPTO","DEDUCCIÓN IMPORTE","DEDUCCIÓN CÓDIGO  SAT","DEDUCCIÓN CÓDIGO INTERNO","DEDUCCIÓN CONCEPTO","DEDUCCIÓN IMPORTE","DEDUCCIÓN CÓDIGO  SAT","DEDUCCIÓN CÓDIGO INTERNO","DEDUCCIÓN CONCEPTO","DEDUCCIÓN IMPORTE","DEDUCCIÓN CÓDIGO  SAT","DEDUCCIÓN CÓDIGO INTERNO","DEDUCCIÓN CONCEPTO","DEDUCCIÓN IMPORTE","DEDUCCIÓN CÓDIGO  SAT","DEDUCCIÓN CÓDIGO INTERNO","DEDUCCIÓN CONCEPTO","DEDUCCIÓN IMPORTE","DEDUCCIÓN CÓDIGO  SAT","DEDUCCIÓN CÓDIGO INTERNO","DEDUCCIÓN CONCEPTO","DEDUCCIÓN IMPORTE","DEDUCCIÓN CÓDIGO  SAT","DEDUCCIÓN CÓDIGO INTERNO","DEDUCCIÓN CONCEPTO","DEDUCCIÓN IMPORTE","DEDUCCIÓN CÓDIGO  SAT","DEDUCCIÓN CÓDIGO INTERNO","DEDUCCIÓN CONCEPTO","DEDUCCIÓN IMPORTE","OTRO PAGO CÓDIGO SAT","OTRO PAGO CÓDIGO INTERNO","OTRO PAGO CONCEPTO","OTRO PAGO IMPORTE","OTRO PAGO CÓDIGO SAT","OTRO PAGO CÓDIGO INTERNO","OTRO PAGO CONCEPTO","OTRO PAGO IMPORTE","OTRO PAGO CÓDIGO SAT","OTRO PAGO CÓDIGO INTERNO","OTRO PAGO CONCEPTO","OTRO PAGO IMPORTE","OTRO PAGO CÓDIGO SAT","OTRO PAGO CÓDIGO INTERNO","OTRO PAGO CONCEPTO","OTRO PAGO IMPORTE","OTRO PAGO CÓDIGO SAT","OTRO PAGO CÓDIGO INTERNO","OTRO PAGO CONCEPTO","OTRO PAGO IMPORTE","HORAS EXTRAS CÓDIGO INTERNO","HORAS EXTRAS Nº DIAS ","HORAS EXTRAS CÓDIGO SAT","HORAS EXTRAS Nº HORAS","HORAS EXTRAS IMPORTE GRAVADO","HORAS EXTRAS IMPORTE EXCENTO","HORAS EXTRAS CÓDIGO INTERNO","HORAS EXTRAS Nº DIAS ","HORAS EXTRAS CÓDIGO SAT","HORAS EXTRAS Nº HORAS","HORAS EXTRAS IMPORTE GRAVADO","HORAS EXTRAS IMPORTE EXCENTO","INCAPACIDAD CÓDIGO INTERNO","INCAPACIDAD Nº DIAS","INCAPACIDAD CÓDIGO SAT","INCAPACIDAD IMPORTE","INCAPACIDAD CÓDIGO INTERNO","INCAPACIDAD Nº DIAS","INCAPACIDAD CÓDIGO SAT","INCAPACIDAD IMPORTE","INCAPACIDAD CÓDIGO INTERNO","INCAPACIDAD Nº DIAS","INCAPACIDAD CÓDIGO SAT","INCAPACIDAD IMPORTE","SEPARACION CÓDIGO INTERNO","SEPARACION TOTAL PAGADO","SEPARACION NÚMERO AÑOS DE SERVICIO","SEPARACION ÚLTIMO SUELDO MENSUAL","SEPARACION INGRESO ACUMULABLE","SEPARACION INGRESO NO ACUMULABLE"]
[{"$f":"RFCEMISOR","v":"AAA010101AAA"},{"$f":"CURPEMISOR","v":0},{"$f":"REGISTROPATRONAL","v":"A9990009900"},{"$f":"REGIMEN_FISCAL","v":"626|Régimen Simplificado de Confianza"},{"$f":"CODIGO_POSTAL","v":"06000"},null,{"$f":"VERSION","v":1.2},{"$f":"TIPO_NOMINA","v":"O|Nómina ordinaria"},{"$f":"VLOOKUP(PERIODONOMINA,PERIOD_NOM,2,0)","v":"2022-11-30"},{"$f":"VLOOKUP(PERIODONOMINA,PERIOD_NOM,3,0)","v":"2022-11-16"},{"$f":"VLOOKUP(PERIODONOMINA,PERIOD_NOM,4,0)","v":"2022-11-30"},{"$f":"IF(VLOOKUP($Y3,CatalogoEmpleados,26,0)=0,\"\",VLOOKUP($Y3,CatalogoEmpleados,26,0))","v":""},{"$f":"PERIODONOMINA","v":1},{"$f":"IF(VLOOKUP($Y3,CatalogoEmpleados,2,0)=0,\"\",VLOOKUP($Y3,CatalogoEmpleados,2,0))","v":"XAXX010101XXX"},{"$f":"CONCATENATE(IF(VLOOKUP($Y3,CatalogoEmpleados,3,0)=0,\"\",VLOOKUP($Y3,CatalogoEmpleados,3,0)),\" \",IF(VLOOKUP($Y3,CatalogoEmpleados,4,0)=0,\"\",VLOOKUP($Y3,CatalogoEmpleados,4,0)),\" \", IF(VLOOKUP($Y3,CatalogoEmpleados,5,0)=0,\"\",VLOOKUP($Y3,CatalogoEmpleados,5,0)))","v":"  "},{"$f":"IF(VLOOKUP($Y3,CatalogoEmpleados,6,0)=0,\"\",VLOOKUP($Y3,CatalogoEmpleados,6,0))","v":""},{"$f":"IF(VLOOKUP($Y3,CatalogoEmpleados,8,0)=0,\"\",VLOOKUP($Y3,CatalogoEmpleados,8,0))","v":""},{"$f":"IF(VLOOKUP($Y3,CatalogoEmpleados,7,0)=0,\"\",VLOOKUP($Y3,CatalogoEmpleados,7,0))","v":""},{"$f":"IF(VLOOKUP($Y3,CatalogoEmpleados,9,0)=0,\"\",VLOOKUP($Y3,CatalogoEmpleados,9,0))","v":"2019-04-16"},{"$f":"IF(VLOOKUP($Y3,CatalogoEmpleados,10,0)=0,\"\",VLOOKUP($Y3,CatalogoEmpleados,10,0))","v":189},{"$f":"IF(VLOOKUP($Y3,CatalogoEmpleados,11,0)=0,\"\",VLOOKUP($Y3,CatalogoEmpleados,11,0))","v":"01|Contrato de trabajo por tiempo indeterminado"},{"$f":"IF(VLOOKUP($Y3,CatalogoEmpleados,12,0)=0,\"\",VLOOKUP($Y3,CatalogoEmpleados,12,0))","v":"No"},{"$f":"IF(VLOOKUP($Y3,CatalogoEmpleados,13,0)=0,\"\",VLOOKUP($Y3,CatalogoEmpleados,13,0))","v":"01|Diurna"},{"$f":"IF(VLOOKUP($Y3,CatalogoEmpleados,14,0)=0,\"\",VLOOKUP($Y3,CatalogoEmpleados,14,0))","v":"02|Sueldos"},{"$f":"Trabajadores!A3","v":1},{"$f":"IF(VLOOKUP($Y3,CatalogoEmpleados,15,0)=0,\"\",VLOOKUP($Y3,CatalogoEmpleados,15,0))","v":""},{"$f":"IF(VLOOKUP($Y3,CatalogoEmpleados,16,0)=0,\"\",VLOOKUP($Y3,CatalogoEmpleados,16,0))","v":"Auxiliar de recepcion"},{"$f":"IF(VLOOKUP($Y3,CatalogoEmpleados,17,0)=0,\"\",VLOOKUP($Y3,CatalogoEmpleados,17,0))","v":"1|Clase I"},{"$f":"IF(VLOOKUP($Y3,CatalogoEmpleados,18,0)=0,\"\",VLOOKUP($Y3,CatalogoEmpleados,18,0))","v":"03|Catorcenal"},{"$f":"IF(VLOOKUP($Y3,CatalogoEmpleados,19,0)=0,\"\",VLOOKUP($Y3,CatalogoEmpleados,19,0))","v":""},{"$f":"IF(VLOOKUP($Y3,CatalogoEmpleados,20,0)=0,\"\",VLOOKUP($Y3,CatalogoEmpleados,20,0))","v":""},{"$f":"IF(VLOOKUP($Y3,CatalogoEmpleados,21,0)=0,\"\",VLOOKUP($Y3,CatalogoEmpleados,21,0))","v":300},{"$f":"IF(VLOOKUP($Y3,CatalogoEmpleados,22,0)=0,\"\",VLOOKUP($Y3,CatalogoEmpleados,22,0))","v":200},{"$f":"IF(VLOOKUP($Y3,CatalogoEmpleados,23,0)=0,\"\",VLOOKUP($Y3,CatalogoEmpleados,23,0))","v":""},{"$f":"IF(VLOOKUP($Y3,CatalogoEmpleados,24,0)=0,\"\",VLOOKUP($Y3,CatalogoEmpleados,24,0))","v":"ejemplo@gmail.com"},{"$f":"IF(VLOOKUP($Y3,CatalogoEmpleados,25,0)=0,\"\",VLOOKUP($Y3,CatalogoEmpleados,25,0))","v":""},null,null,null,null,null,null,null,null,null,null,null,{"$f":"IF(ISERROR(VLOOKUP($AU3,PERCEPCIONES,3,0)),\"\",VLOOKUP($AU3,PERCEPCIONES,3,0))","v":""},{"$f":"IF(ISERROR(VLOOKUP($AU3,PERCEPCIONES,2,0)),\"\",VLOOKUP($AU3,PERCEPCIONES,2,0))","v":""},null,null,null,{"$f":"IF(ISERROR(VLOOKUP($AZ3,PERCEPCIONES,3,0)),\"\",VLOOKUP($AZ3,PERCEPCIONES,3,0))","v":""},{"$f":"IF(ISERROR(VLOOKUP($AZ3,PERCEPCIONES,2,0)),\"\",VLOOKUP($AZ3,PERCEPCIONES,2,0))","v":""},null,null,null,{"$f":"IF(ISERROR(VLOOKUP($BE3,PERCEPCIONES,3,0)),\"\",VLOOKUP($BE3,PERCEPCIONES,3,0))","v":""},{"$f":"IF(ISERROR(VLOOKUP($BE3,PERCEPCIONES,2,0)),\"\",VLOOKUP($BE3,PERCEPCIONES,2,0))","v":""},null,null,null,{"$f":"IF(ISERROR(VLOOKUP($BJ3,PERCEPCIONES,3,0)),\"\",VLOOKUP($BJ3,PERCEPCIONES,3,0))","v":""},{"$f":"IF(ISERROR(VLOOKUP($BJ3,PERCEPCIONES,2,0)),\"\",VLOOKUP($BJ3,PERCEPCIONES,2,0))","v":""},null,null,null,{"$f":"IF(ISERROR(VLOOKUP($BO3,PERCEPCIONES,3,0)),\"\",VLOOKUP($BO3,PERCEPCIONES,3,0))","v":""},{"$f":"IF(ISERROR(VLOOKUP($BO3,PERCEPCIONES,2,0)),\"\",VLOOKUP($BO3,PERCEPCIONES,2,0))","v":""},null,null,null,{"$f":"IF(ISERROR(VLOOKUP($BT3,PERCEPCIONES,3,0)),\"\",VLOOKUP($BT3,PERCEPCIONES,3,0))","v":""},{"$f":"IF(ISERROR(VLOOKUP($BT3,PERCEPCIONES,2,0)),\"\",VLOOKUP($BT3,PERCEPCIONES,2,0))","v":""},null,null,null,{"$f":"IF(ISERROR(VLOOKUP($BY3,PERCEPCIONES,3,0)),\"\",VLOOKUP($BY3,PERCEPCIONES,3,0))","v":""},{"$f":"IF(ISERROR(VLOOKUP($BY3,PERCEPCIONES,2,0)),\"\",VLOOKUP($BY3,PERCEPCIONES,2,0))","v":""},null,null,null,{"$f":"IF(ISERROR(VLOOKUP($CD3,PERCEPCIONES,3,0)),\"\",VLOOKUP($CD3,PERCEPCIONES,3,0))","v":""},{"$f":"IF(ISERROR(VLOOKUP($CD3,PERCEPCIONES,2,0)),\"\",VLOOKUP($CD3,PERCEPCIONES,2,0))","v":""},null,null,null,{"$f":"IF(ISERROR(VLOOKUP($CI3,PERCEPCIONES,3,0)),\"\",VLOOKUP($CI3,PERCEPCIONES,3,0))","v":""},{"$f":"IF(ISERROR(VLOOKUP($CI3,PERCEPCIONES,2,0)),\"\",VLOOKUP($CI3,PERCEPCIONES,2,0))","v":""},null,null,null,{"$f":"IF(ISERROR(VLOOKUP($CN3,PERCEPCIONES,3,0)),\"\",VLOOKUP($CN3,PERCEPCIONES,3,0))","v":""},{"$f":"IF(ISERROR(VLOOKUP($CN3,PERCEPCIONES,2,0)),\"\",VLOOKUP($CN3,PERCEPCIONES,2,0))","v":""},null,null,null,{"$f":"IF(ISERROR(VLOOKUP($CS3,PERCEPCIONES,3,0)),\"\",VLOOKUP($CS3,PERCEPCIONES,3,0))","v":""},{"$f":"IF(ISERROR(VLOOKUP($CS3,PERCEPCIONES,2,0)),\"\",VLOOKUP($CS3,PERCEPCIONES,2,0))","v":""},null,null,null,{"$f":"IF(ISERROR(VLOOKUP($CX3,PERCEPCIONES,3,0)),\"\",VLOOKUP($CX3,PERCEPCIONES,3,0))","v":""},{"$f":"IF(ISERROR(VLOOKUP($CX3,PERCEPCIONES,2,0)),\"\",VLOOKUP($CX3,PERCEPCIONES,2,0))","v":""},null,null,null,{"$f":"IF(ISERROR(VLOOKUP($DC3,DEDUCCIONES,3,0)),\"\",VLOOKUP($DC3,DEDUCCIONES,3,0))","v":""},{"$f":"IF(ISERROR(VLOOKUP($DC3,DEDUCCIONES,2,0)),\"\",VLOOKUP($DC3,DEDUCCIONES,2,0))","v":""},null,null,{"$f":"IF(ISERROR(VLOOKUP($DG3,DEDUCCIONES,3,0)),\"\",VLOOKUP($DG3,DEDUCCIONES,3,0))","v":""},{"$f":"IF(ISERROR(VLOOKUP($DG3,DEDUCCIONES,2,0)),\"\",VLOOKUP($DG3,DEDUCCIONES,2,0))","v":""},null,null,{"$f":"IF(ISERROR(VLOOKUP($DK3,DEDUCCIONES,3,0)),\"\",VLOOKUP($DK3,DEDUCCIONES,3,0))","v":""},{"$f":"IF(ISERROR(VLOOKUP($DK3,DEDUCCIONES,2,0)),\"\",VLOOKUP($DK3,DEDUCCIONES,2,0))","v":""},null,null,{"$f":"IF(ISERROR(VLOOKUP($DO3,DEDUCCIONES,3,0)),\"\",VLOOKUP($DO3,DEDUCCIONES,3,0))","v":""},{"$f":"IF(ISERROR(VLOOKUP($DO3,DEDUCCIONES,2,0)),\"\",VLOOKUP($DO3,DEDUCCIONES,2,0))","v":""},null,null,{"$f":"IF(ISERROR(VLOOKUP($DS3,DEDUCCIONES,3,0)),\"\",VLOOKUP($DS3,DEDUCCIONES,3,0))","v":""},{"$f":"IF(ISERROR(VLOOKUP($DS3,DEDUCCIONES,2,0)),\"\",VLOOKUP($DS3,DEDUCCIONES,2,0))","v":""},null,null,{"$f":"IF(ISERROR(VLOOKUP($DW3,DEDUCCIONES,3,0)),\"\",VLOOKUP($DW3,DEDUCCIONES,3,0))","v":""},{"$f":"IF(ISERROR(VLOOKUP($DW3,DEDUCCIONES,2,0)),\"\",VLOOKUP($DW3,DEDUCCIONES,2,0))","v":""},null,null,{"$f":"IF(ISERROR(VLOOKUP($EA3,DEDUCCIONES,3,0)),\"\",VLOOKUP($EA3,DEDUCCIONES,3,0))","v":""},{"$f":"IF(ISERROR(VLOOKUP($EA3,DEDUCCIONES,2,0)),\"\",VLOOKUP($EA3,DEDUCCIONES,2,0))","v":""},null,null,{"$f":"IF(ISERROR(VLOOKUP($EE3,DEDUCCIONES,3,0)),\"\",VLOOKUP($EE3,DEDUCCIONES,3,0))","v":""},{"$f":"IF(ISERROR(VLOOKUP($EE3,DEDUCCIONES,2,0)),\"\",VLOOKUP($EE3,DEDUCCIONES,2,0))","v":""},null,null,{"$f":"IF(ISERROR(VLOOKUP($EI3,DEDUCCIONES,3,0)),\"\",VLOOKUP($EI3,DEDUCCIONES,3,0))","v":""},{"$f":"IF(ISERROR(VLOOKUP($EI3,DEDUCCIONES,2,0)),\"\",VLOOKUP($EI3,DEDUCCIONES,2,0))","v":""},null,null,{"$f":"IF(ISERROR(VLOOKUP($EM3,DEDUCCIONES,3,0)),\"\",VLOOKUP($EM3,DEDUCCIONES,3,0))","v":""},{"$f":"IF(ISERROR(VLOOKUP($EM3,DEDUCCIONES,2,0)),\"\",VLOOKUP($EM3,DEDUCCIONES,2,0))","v":""},null,null,{"$f":"IF(ISERROR(VLOOKUP($EQ3,DEDUCCIONES,3,0)),\"\",VLOOKUP($EQ3,DEDUCCIONES,3,0))","v":""},{"$f":"IF(ISERROR(VLOOKUP($EQ3,DEDUCCIONES,2,0)),\"\",VLOOKUP($EQ3,DEDUCCIONES,2,0))","v":""},null,null,{"$f":"IF(ISERROR(VLOOKUP($EU3,DEDUCCIONES,3,0)),\"\",VLOOKUP($EU3,DEDUCCIONES,3,0))","v":""},{"$f":"IF(ISERROR(VLOOKUP($EU3,DEDUCCIONES,2,0)),\"\",VLOOKUP($EU3,DEDUCCIONES,2,0))","v":""},null,null,{"$f":"IF(ISERROR(VLOOKUP($EY3,COD_OTRO_PAGO,3,0)),\"\",VLOOKUP($EY3,COD_OTRO_PAGO,3,0))","v":""},{"$f":"IF(ISERROR(VLOOKUP($EY3,COD_OTRO_PAGO,2,0)),\"\",VLOOKUP($EY3,COD_OTRO_PAGO,2,0))","v":""},null,null,{"$f":"IF(ISERROR(VLOOKUP($FC3,COD_OTRO_PAGO,3,0)),\"\",VLOOKUP($FC3,COD_OTRO_PAGO,3,0))","v":""},{"$f":"IF(ISERROR(VLOOKUP($FC3,COD_OTRO_PAGO,2,0)),\"\",VLOOKUP($FC3,COD_OTRO_PAGO,2,0))","v":""},null,null,{"$f":"IF(ISERROR(VLOOKUP($FG3,COD_OTRO_PAGO,3,0)),\"\",VLOOKUP($FG3,COD_OTRO_PAGO,3,0))","v":""},{"$f":"IF(ISERROR(VLOOKUP($FG3,COD_OTRO_PAGO,2,0)),\"\",VLOOKUP($FG3,COD_OTRO_PAGO,2,0))","v":""},null,null,{"$f":"IF(ISERROR(VLOOKUP($FK3,COD_OTRO_PAGO,3,0)),\"\",VLOOKUP($FK3,COD_OTRO_PAGO,3,0))","v":""},{"$f":"IF(ISERROR(VLOOKUP($FK3,COD_OTRO_PAGO,2,0)),\"\",VLOOKUP($FK3,COD_OTRO_PAGO,2,0))","v":""},null,null,{"$f":"IF(ISERROR(VLOOKUP($FO3,COD_OTRO_PAGO,3,0)),\"\",VLOOKUP($FO3,COD_OTRO_PAGO,3,0))","v":""},{"$f":"IF(ISERROR(VLOOKUP($FO3,COD_OTRO_PAGO,2,0)),\"\",VLOOKUP($FO3,COD_OTRO_PAGO,2,0))","v":""},null,{"$f":"IF(ISERROR(VLOOKUP($FU3,COD_HORAS_EXTRA,3,0)),\"\",VLOOKUP($FU3,COD_HORAS_EXTRA,3,0))","v":""},null,null,null,null,null,{"$f":"IF(ISERROR(VLOOKUP($GA3,COD_HORAS_EXTRA,3,0)),\"\",VLOOKUP($GA3,COD_HORAS_EXTRA,3,0))","v":""},null,null,null,null,null,{"$f":"IF(ISERROR(VLOOKUP($GG3,COD_TIP_INCA,3,0)),\"\",VLOOKUP($GG3,COD_TIP_INCA,3,0))","v":""},null,null,null,{"$f":"IF(ISERROR(VLOOKUP($GK3,COD_TIP_INCA,3,0)),\"\",VLOOKUP($GK3,COD_TIP_INCA,3,0))","v":""},null,null,null,{"$f":"IF(ISERROR(VLOOKUP($GO3,COD_TIP_INCA,3,0)),\"\",VLOOKUP($GO3,COD_TIP_INCA,3,0))","v":""}]
[{"$f":"RFCEMISOR","v":"AAA010101AAA"},{"$f":"CURPEMISOR","v":0},{"$f":"REGISTROPATRONAL","v":"A9990009900"},{"$f":"REGIMEN_FISCAL","v":"626|Régimen Simplificado de Confianza"},{"$f":"CODIGO_POSTAL","v":"06000"},null,{"$f":"VERSION","v":1.2},{"$f":"TIPO_NOMINA","v":"O|Nómina ordinaria"},{"$f":"VLOOKUP(PERIODONOMINA,PERIOD_NOM,2,0)","v":"2022-11-30"},{"$f":"VLOOKUP(PERIODONOMINA,PERIOD_NOM,3,0)","v":"2022-11-16"},{"$f":"VLOOKUP(PERIODONOMINA,PERIOD_NOM,4,0)","v":"2022-11-30"},{"$f":"IF(VLOOKUP($Y4,CatalogoEmpleados,26,0)=0,\"\",VLOOKUP($Y4,CatalogoEmpleados,26,0))","v":""},{"$f":"PERIODONOMINA","v":1},{"$f":"IF(VLOOKUP($Y4,CatalogoEmpleados,2,0)=0,\"\",VLOOKUP($Y4,CatalogoEmpleados,2,0))","v":"XAXX010101XXX"},{"$f":"CONCATENATE(IF(VLOOKUP($Y4,CatalogoEmpleados,3,0)=0,\"\",VLOOKUP($Y4,CatalogoEmpleados,3,0)),\" \",IF(VLOOKUP($Y4,CatalogoEmpleados,4,0)=0,\"\",VLOOKUP($Y4,CatalogoEmpleados,4,0)),\" \", IF(VLOOKUP($Y4,CatalogoEmpleados,5,0)=0,\"\",VLOOKUP($Y4,CatalogoEmpleados,5,0)))","v":"  "},{"$f":"IF(VLOOKUP($Y4,CatalogoEmpleados,6,0)=0,\"\",VLOOKUP($Y4,CatalogoEmpleados,6,0))","v":""},{"$f":"IF(VLOOKUP($Y4,CatalogoEmpleados,8,0)=0,\"\",VLOOKUP($Y4,CatalogoEmpleados,8,0))","v":""},{"$f":"IF(VLOOKUP($Y4,CatalogoEmpleados,7,0)=0,\"\",VLOOKUP($Y4,CatalogoEmpleados,7,0))","v":""},{"$f":"IF(VLOOKUP($Y4,CatalogoEmpleados,9,0)=0,\"\",VLOOKUP($Y4,CatalogoEmpleados,9,0))","v":"2022-10-01"},{"$f":"IF(VLOOKUP($Y4,CatalogoEmpleados,10,0)=0,\"\",VLOOKUP($Y4,CatalogoEmpleados,10,0))","v":8},{"$f":"IF(VLOOKUP($Y4,CatalogoEmpleados,11,0)=0,\"\",VLOOKUP($Y4,CatalogoEmpleados,11,0))","v":"01|Contrato de trabajo por tiempo indeterminado"},{"$f":"IF(VLOOKUP($Y4,CatalogoEmpleados,12,0)=0,\"\",VLOOKUP($Y4,CatalogoEmpleados,12,0))","v":"No"},{"$f":"IF(VLOOKUP($Y4,CatalogoEmpleados,13,0)=0,\"\",VLOOKUP($Y4,CatalogoEmpleados,13,0))","v":"01|Diurna"},{"$f":"IF(VLOOKUP($Y4,CatalogoEmpleados,14,0)=0,\"\",VLOOKUP($Y4,CatalogoEmpleados,14,0))","v":"02|Sueldos"},{"$f":"Trabajadores!A4","v":2},{"$f":"IF(VLOOKUP($Y4,CatalogoEmpleados,15,0)=0,\"\",VLOOKUP($Y4,CatalogoEmpleados,15,0))","v":""},{"$f":"IF(VLOOKUP($Y4,CatalogoEmpleados,16,0)=0,\"\",VLOOKUP($Y4,CatalogoEmpleados,16,0))","v":"Cajera"},{"$f":"IF(VLOOKUP($Y4,CatalogoEmpleados,17,0)=0,\"\",VLOOKUP($Y4,CatalogoEmpleados,17,0))","v":"1|Clase I"},{"$f":"IF(VLOOKUP($Y4,CatalogoEmpleados,18,0)=0,\"\",VLOOKUP($Y4,CatalogoEmpleados,18,0))","v":"03|Catorcenal"},{"$f":"IF(VLOOKUP($Y4,CatalogoEmpleados,19,0)=0,\"\",VLOOKUP($Y4,CatalogoEmpleados,19,0))","v":""},{"$f":"IF(VLOOKUP($Y4,CatalogoEmpleados,20,0)=0,\"\",VLOOKUP($Y4,CatalogoEmpleados,20,0))","v":""},{"$f":"IF(VLOOKUP($Y4,CatalogoEmpleados,21,0)=0,\"\",VLOOKUP($Y4,CatalogoEmpleados,21,0))","v":""},{"$f":"IF(VLOOKUP($Y4,CatalogoEmpleados,22,0)=0,\"\",VLOOKUP($Y4,CatalogoEmpleados,22,0))","v":""},{"$f":"IF(VLOOKUP($Y4,CatalogoEmpleados,23,0)=0,\"\",VLOOKUP($Y4,CatalogoEmpleados,23,0))","v":""},{"$f":"IF(VLOOKUP($Y4,CatalogoEmpleados,24,0)=0,\"\",VLOOKUP($Y4,CatalogoEmpleados,24,0))","v":""},{"$f":"IF(VLOOKUP($Y4,CatalogoEmpleados,25,0)=0,\"\",VLOOKUP($Y4,CatalogoEmpleados,25,0))","v":""},null,null,null,null,null,null,null,null,null,null,null,"","",null,null,null,"","",null,null,null,"","",null,null,null,"","",null,null,null,"","",null,null,null,"","",null,null,null,"","",null,null,null,"","",null,null,null,"","",null,null,null,"","",null,null,null,"","",null,null,null,"","",null,null,null,"","",null,null,"","",null,null,"","",null,null,"","",null,null,"","",null,null,"","",null,null,"","",null,null,"","",null,null,"","",null,null,"","",null,null,"","",null,null,"","",null,null,"","",null,null,"","",null,null,"","",null,null,"","",null,null,"","",null,"",null,null,null,null,null,"",null,null,null,null,null,"",null,null,null,"",null,null,null,""]
[null,null,null,null,null,null,null,null,null,null,null,null,null,null,null,null,null,null,null,null,null,null,null,null,null,null,null,null,null,null,null,null,null,null,null,null,null,null,null,null,null,null,null,null,null,null,null,"","",null,null,null,"","",null,null,null,"","",null,null,null,"","",null,null,null,"","",null,null,null,"","",null,null,null,"","",null,null,null,"","",null,null,null,"","",null,null,null,"","",null,null,null,"","",null,null,null,"","",null,null,null,"","",null,null,"","",null,null,"","",null,null,"","",null,null,"","",null,null,"","",null,null,"","",null,null,"","",null,null,"","",null,null,"","",null,null,"","",null,null,"","",null,null,"","",null,null,"","",null,null,"","",null,null,"","",null,null,"","",null,"",null,null,null,null,null,"",null,null,null,null,null,"",null,null,null,"",null,null,null,""]
[null,null,null,null,null,null,null,null,null,null,null,null,null,null,null,null,null,null,null,null,null,null,null,null,null,null,null,null,null,null,null,null,null,null,null,null,null,null,null,null,null,null,null,null,null,null,null,"","",null,null,null,"","",null,null,null,"","",null,null,null,"","",null,null,null,"","",null,null,null,"","",null,null,null,"","",null,null,null,"","",null,null,null,"","",null,null,null,"","",null,null,null,"","",null,null,null,"","",null,null,null,"","",null,null,"","",null,null,"","",null,null,"","",null,null,"","",null,null,"","",null,null,"","",null,null,"","",null,null,"","",null,null,"","",null,null,"","",null,null,"","",null,null,"","",null,null,"","",null,null,"","",null,null,"","",null,null,"","",null,"",null,null,null,null,null,"",null,null,null,null,null,"",null,null,null,"",null,null,null,""]
[null,null,null,null,null,null,null,null,null,null,null,null,null,null,null,null,null,null,null,null,null,null,null,null,null,null,null,null,null,null,null,null,null,null,null,null,null,null,null,null,null,null,null,null,null,null,null,"","",null,null,null,"","",null,null,null,"","",null,null,null,"","",null,null,null,"","",null,null,null,"","",null,null,null,"","",null,null,null,"","",null,null,null,"","",null,null,null,"","",null,null,null,"","",null,null,null,"","",null,null,null,"","",null,null,"","",null,null,"","",null,null,"","",null,null,"","",null,null,"","",null,null,"","",null,null,"","",null,null,"","",null,null,"","",null,null,"","",null,null,"","",null,null,"","",null,null,"","",null,null,"","",null,null,"","",null,null,"","",null,"",null,null,null,null,null,"",null,null,null,null,null,"",null,null,null,"",null,null,null,""]
[null,null,null,null,null,null,null,null,null,null,null,null,null,null,null,null,null,null,null,null,null,null,null,null,null,null,null,null,null,null,null,null,null,null,null,null,null,null,null,null,null,null,null,null,null,null,null,"","",null,null,null,"","",null,null,null,"","",null,null,null,"","",null,null,null,"","",null,null,null,"","",null,null,null,"","",null,null,null,"","",null,null,null,"","",null,null,null,"","",null,null,null,"","",null,null,null,"","",null,null,null,"","",null,null,"","",null,null,"","",null,null,"","",null,null,"","",null,null,"","",null,null,"","",null,null,"","",null,null,"","",null,null,"","",null,null,"","",null,null,"","",null,null,"","",null,null,"","",null,null,"","",null,null,"","",null,null,"","",null,"",null,null,null,null,null,"",null,null,null,null,null,"",null,null,null,"",null,null,null,""]
[null,null,null,null,null,null,null,null,null,null,null,null,null,null,null,null,null,null,null,null,null,null,null,null,null,null,null,null,null,null,null,null,null,null,null,null,null,null,null,null,null,null,null,null,null,null,null,"","",null,null,null,"","",null,null,null,"","",null,null,null,"","",null,null,null,"","",null,null,null,"","",null,null,null,"","",null,null,null,"","",null,null,null,"","",null,null,null,"","",null,null,null,"","",null,null,null,"","",null,null,null,"","",null,null,"","",null,null,"","",null,null,"","",null,null,"","",null,null,"","",null,null,"","",null,null,"","",null,null,"","",null,null,"","",null,null,"","",null,null,"","",null,null,"","",null,null,"","",null,null,"","",null,null,"","",null,null,"","",null,"",null,null,null,null,null,"",null,null,null,null,null,"",null,null,null,"",null,null,null,""]
[null,null,null,null,null,null,null,null,null,null,null,null,null,null,null,null,null,null,null,null,null,null,null,null,null,null,null,null,null,null,null,null,null,null,null,null,null,null,null,null,null,null,null,null,null,null,null,"","",null,null,null,"","",null,null,null,"","",null,null,null,"","",null,null,null,"","",null,null,null,"","",null,null,null,"","",null,null,null,"","",null,null,null,"","",null,null,null,"","",null,null,null,"","",null,null,null,"","",null,null,null,"","",null,null,"","",null,null,"","",null,null,"","",null,null,"","",null,null,"","",null,null,"","",null,null,"","",null,null,"","",null,null,"","",null,null,"","",null,null,"","",null,null,"","",null,null,"","",null,null,"","",null,null,"","",null,null,"","",null,"",null,null,null,null,null,"",null,null,null,null,null,"",null,null,null,"",null,null,null,""]
[null,null,null,null,null,null,null,null,null,null,null,null,null,null,null,null,null,null,null,null,null,null,null,null,null,null,null,null,null,null,null,null,null,null,null,null,null,null,null,null,null,null,null,null,null,null,null,"","",null,null,null,"","",null,null,null,"","",null,null,null,"","",null,null,null,"","",null,null,null,"","",null,null,null,"","",null,null,null,"","",null,null,null,"","",null,null,null,"","",null,null,null,"","",null,null,null,"","",null,null,null,"","",null,null,"","",null,null,"","",null,null,"","",null,null,"","",null,null,"","",null,null,"","",null,null,"","",null,null,"","",null,null,"","",null,null,"","",null,null,"","",null,null,"","",null,null,"","",null,null,"","",null,null,"","",null,null,"","",null,"",null,null,null,null,null,"",null,null,null,null,null,"",null,null,null,"",null,null,null,""]
[null,null,null,null,null,null,null,null,null,null,null,null,null,null,null,null,null,null,null,null,null,null,null,null,null,null,null,null,null,null,null,null,null,null,null,null,null,null,null,null,null,null,null,null,null,null,null,"","",null,null,null,"","",null,null,null,"","",null,null,null,"","",null,null,null,"","",null,null,null,"","",null,null,null,"","",null,null,null,"","",null,null,null,"","",null,null,null,"","",null,null,null,"","",null,null,null,"","",null,null,null,"","",null,null,"","",null,null,"","",null,null,"","",null,null,"","",null,null,"","",null,null,"","",null,null,"","",null,null,"","",null,null,"","",null,null,"","",null,null,"","",null,null,"","",null,null,"","",null,null,"","",null,null,"","",null,null,"","",null,"",null,null,null,null,null,"",null,null,null,null,null,"",null,null,null,"",null,null,null,""]
[null,null,null,null,null,null,null,null,null,null,null,null,null,null,null,null,null,null,null,null,null,null,null,null,null,null,null,null,null,null,null,null,null,null,null,null,null,null,null,null,null,null,null,null,null,null,null,"","",null,null,null,"","",null,null,null,"","",null,null,null,"","",null,null,null,"","",null,null,null,"","",null,null,null,"","",null,null,null,"","",null,null,null,"","",null,null,null,"","",null,null,null,"","",null,null,null,"","",null,null,null,"","",null,null,"","",null,null,"","",null,null,"","",null,null,"","",null,null,"","",null,null,"","",null,null,"","",null,null,"","",null,null,"","",null,null,"","",null,null,"","",null,null,"","",null,null,"","",null,null,"","",null,null,"","",null,null,"","",null,"",null,null,null,null,null,"",null,null,null,null,null,"",null,null,null,"",null,null,null,""]
[null,null,null,null,null,null,null,null,null,null,null,null,null,null,null,null,null,null,null,null,null,null,null,null,null,null,null,null,null,null,null,null,null,null,null,null,null,null,null,null,null,null,null,null,null,null,null,"","",null,null,null,"","",null,null,null,"","",null,null,null,"","",null,null,null,"","",null,null,null,"","",null,null,null,"","",null,null,null,"","",null,null,null,"","",null,null,null,"","",null,null,null,"","",null,null,null,"","",null,null,null,"","",null,null,"","",null,null,"","",null,null,"","",null,null,"","",null,null,"","",null,null,"","",null,null,"","",null,null,"","",null,null,"","",null,null,"","",null,null,"","",null,null,"","",null,null,"","",null,null,"","",null,null,"","",null,null,"","",null,"",null,null,null,null,null,"",null,null,null,null,null,"",null,null,null,"",null,null,null,""]
[null,null,null,null,null,null,null,null,null,null,null,null,null,null,null,null,null,null,null,null,null,null,null,null,null,null,null,null,null,null,null,null,null,null,null,null,null,null,null,null,null,null,null,null,null,null,null,"","",null,null,null,"","",null,null,null,"","",null,null,null,"","",null,null,null,"","",null,null,null,"","",null,null,null,"","",null,null,null,"","",null,null,null,"","",null,null,null,"","",null,null,null,"","",null,null,null,"","",null,null,null,"","",null,null,"","",null,null,"","",null,null,"","",null,null,"","",null,null,"","",null,null,"","",null,null,"","",null,null,"","",null,null,"","",null,null,"","",null,null,"","",null,null,"","",null,null,"","",null,null,"","",null,null,"","",null,null,"","",null,"",null,null,null,null,null,"",null,null,null,null,null,"",null,null,null,"",null,null,null,""]
[null,null,null,null,null,null,null,null,null,null,null,null,null,null,null,null,null,null,null,null,null,null,null,null,null,null,null,null,null,null,null,null,null,null,null,null,null,null,null,null,null,null,null,null,null,null,null,"","",null,null,null,"","",null,null,null,"","",null,null,null,"","",null,null,null,"","",null,null,null,"","",null,null,null,"","",null,null,null,"","",null,null,null,"","",null,null,null,"","",null,null,null,"","",null,null,null,"","",null,null,null,"","",null,null,"","",null,null,"","",null,null,"","",null,null,"","",null,null,"","",null,null,"","",null,null,"","",null,null,"","",null,null,"","",null,null,"","",null,null,"","",null,null,"","",null,null,"","",null,null,"","",null,null,"","",null,null,"","",null,"",null,null,null,null,null,"",null,null,null,null,null,"",null,null,null,"",null,null,null,""]
[null,null,null,null,null,null,null,null,null,null,null,null,null,null,null,null,null,null,null,null,null,null,null,null,null,null,null,null,null,null,null,null,null,null,null,null,null,null,null,null,null,null,null,null,null,null,null,"","",null,null,null,"","",null,null,null,"","",null,null,null,"","",null,null,null,"","",null,null,null,"","",null,null,null,"","",null,null,null,"","",null,null,null,"","",null,null,null,"","",null,null,null,"","",null,null,null,"","",null,null,null,"","",null,null,"","",null,null,"","",null,null,"","",null,null,"","",null,null,"","",null,null,"","",null,null,"","",null,null,"","",null,null,"","",null,null,"","",null,null,"","",null,null,"","",null,null,"","",null,null,"","",null,null,"","",null,null,"","",null,"",null,null,null,null,null,"",null,null,null,null,null,"",null,null,null,"",null,null,null,""]
[null,null,null,null,null,null,null,null,null,null,null,null,null,null,null,null,null,null,null,null,null,null,null,null,null,null,null,null,null,null,null,null,null,null,null,null,null,null,null,null,null,null,null,null,null,null,null,"","",null,null,null,"","",null,null,null,"","",null,null,null,"","",null,null,null,"","",null,null,null,"","",null,null,null,"","",null,null,null,"","",null,null,null,"","",null,null,null,"","",null,null,null,"","",null,null,null,"","",null,null,null,"","",null,null,"","",null,null,"","",null,null,"","",null,null,"","",null,null,"","",null,null,"","",null,null,"","",null,null,"","",null,null,"","",null,null,"","",null,null,"","",null,null,"","",null,null,"","",null,null,"","",null,null,"","",null,null,"","",null,"",null,null,null,null,null,"",null,null,null,null,null,"",null,null,null,"",null,null,null,""]
[null,null,null,null,null,null,null,null,null,null,null,null,null,null,null,null,null,null,null,null,null,null,null,null,null,null,null,null,null,null,null,null,null,null,null,null,null,null,null,null,null,null,null,null,null,null,null,"","",null,null,null,"","",null,null,null,"","",null,null,null,"","",null,null,null,"","",null,null,null,"","",null,null,null,"","",null,null,null,"","",null,null,null,"","",null,null,null,"","",null,null,null,"","",null,null,null,"","",null,null,null,"","",null,null,"","",null,null,"","",null,null,"","",null,null,"","",null,null,"","",null,null,"","",null,null,"","",null,null,"","",null,null,"","",null,null,"","",null,null,"","",null,null,"","",null,null,"","",null,null,"","",null,null,"","",null,null,"","",null,"",null,null,null,null,null,"",null,null,null,null,null,"",null,null,null,"",null,null,null,""]
[null,null,null,null,null,null,null,null,null,null,null,null,null,null,null,null,null,null,null,null,null,null,null,null,null,null,null,null,null,null,null,null,null,null,null,null,null,null,null,null,null,null,null,null,null,null,null,"","",null,null,null,"","",null,null,null,"","",null,null,null,"","",null,null,null,"","",null,null,null,"","",null,null,null,"","",null,null,null,"","",null,null,null,"","",null,null,null,"","",null,null,null,"","",null,null,null,"","",null,null,null,"","",null,null,"","",null,null,"","",null,null,"","",null,null,"","",null,null,"","",null,null,"","",null,null,"","",null,null,"","",null,null,"","",null,null,"","",null,null,"","",null,null,"","",null,null,"","",null,null,"","",null,null,"","",null,null,"","",null,"",null,null,null,null,null,"",null,null,null,null,null,"",null,null,null,"",null,null,null,""]
[null,null,null,null,null,null,null,null,null,null,null,null,null,null,null,null,null,null,null,null,null,null,null,null,null,null,null,null,null,null,null,null,null,null,null,null,null,null,null,null,null,null,null,null,null,null,null,null,null,null,null,null,"","",null,null,null,"","",null,null,null,"","",null,null,null,"","",null,null,null,"","",null,null,null,"","",null,null,null,"","",null,null,null,"","",null,null,null,"","",null,null,null,"","",null,null,null,"","",null,null,null,"","",null,null,"","",null,null,"","",null,null,"","",null,null,"","",null,null,"","",null,null,"","",null,null,"","",null,null,"","",null,null,"","",null,null,"","",null,null,"","",null,null,"","",null,null,"","",null,null,"","",null,null,"","",null,null,"","",null,"",null,null,null,null,null,"",null,null,null,null,null,"",null,null,null,"",null,null,null,""]
[null,null,null,null,null,null,null,null,null,null,null,null,null,null,null,null,null,null,null,null,null,null,null,null,null,null,null,null,null,null,null,null,null,null,null,null,null,null,null,null,null,null,null,null,null,null,null,null,null,null,null,null,"","",null,null,null,"","",null,null,null,"","",null,null,null,"","",null,null,null,"","",null,null,null,"","",null,null,null,"","",null,null,null,"","",null,null,null,"","",null,null,null,"","",null,null,null,"","",null,null,null,"","",null,null,"","",null,null,"","",null,null,"","",null,null,"","",null,null,"","",null,null,"","",null,null,"","",null,null,"","",null,null,"","",null,null,"","",null,null,"","",null,null,"","",null,null,"","",null,null,"","",null,null,"","",null,null,"","",null,"",null,null,null,null,null,"",null,null,null,null,null,"",null,null,null,"",null,null,null,""]
[null,null,null,null,null,null,null,null,null,null,null,null,null,null,null,null,null,null,null,null,null,null,null,null,null,null,null,null,null,null,null,null,null,null,null,null,null,null,null,null,null,null,null,null,null,null,null,null,null,null,null,null,"","",null,null,null,"","",null,null,null,"","",null,null,null,"","",null,null,null,"","",null,null,null,"","",null,null,null,"","",null,null,null,"","",null,null,null,"","",null,null,null,"","",null,null,null,"","",null,null,null,"","",null,null,"","",null,null,"","",null,null,"","",null,null,"","",null,null,"","",null,null,"","",null,null,"","",null,null,"","",null,null,"","",null,null,"","",null,null,"","",null,null,"","",null,null,"","",null,null,"","",null,null,"","",null,null,"","",null,"",null,null,null,null,null,"",null,null,null,null,null,"",null,null,null,"",null,null,null,""]
[null,null,null,null,null,null,null,null,null,null,null,null,null,null,null,null,null,null,null,null,null,null,null,null,null,null,null,null,null,null,null,null,null,null,null,null,null,null,null,null,null,null,null,null,null,null,null,null,null,null,null,null,"","",null,null,null,"","",null,null,null,"","",null,null,null,"","",null,null,null,"","",null,null,null,"","",null,null,null,"","",null,null,null,"","",null,null,null,"","",null,null,null,"","",null,null,null,"","",null,null,null,"","",null,null,"","",null,null,"","",null,null,"","",null,null,"","",null,null,"","",null,null,"","",null,null,"","",null,null,"","",null,null,"","",null,null,"","",null,null,"","",null,null,"","",null,null,"","",null,null,"","",null,null,"","",null,null,"","",null,"",null,null,null,null,null,"",null,null,null,null,null,"",null,null,null,"",null,null,null,""]
[null,null,null,null,null,null,null,null,null,null,null,null,null,null,null,null,null,null,null,null,null,null,null,null,null,null,null,null,null,null,null,null,null,null,null,null,null,null,null,null,null,null,null,null,null,null,null,null,null,null,null,null,"","",null,null,null,"","",null,null,null,"","",null,null,null,"","",null,null,null,"","",null,null,null,"","",null,null,null,"","",null,null,null,"","",null,null,null,"","",null,null,null,"","",null,null,null,"","",null,null,null,"","",null,null,"","",null,null,"","",null,null,"","",null,null,"","",null,null,"","",null,null,"","",null,null,"","",null,null,"","",null,null,"","",null,null,"","",null,null,"","",null,null,"","",null,null,"","",null,null,"","",null,null,"","",null,null,"","",null,"",null,null,null,null,null,"",null,null,null,null,null,"",null,null,null,"",null,null,null,""]
[null,null,null,null,null,null,null,null,null,null,null,null,null,null,null,null,null,null,null,null,null,null,null,null,null,null,null,null,null,null,null,null,null,null,null,null,null,null,null,null,null,null,null,null,null,null,null,null,null,null,null,null,"","",null,null,null,"","",null,null,null,"","",null,null,null,"","",null,null,null,"","",null,null,null,"","",null,null,null,"","",null,null,null,"","",null,null,null,"","",null,null,null,"","",null,null,null,"","",null,null,null,"","",null,null,"","",null,null,"","",null,null,"","",null,null,"","",null,null,"","",null,null,"","",null,null,"","",null,null,"","",null,null,"","",null,null,"","",null,null,"","",null,null,"","",null,null,"","",null,null,"","",null,null,"","",null,null,"","",null,"",null,null,null,null,null,"",null,null,null,null,null,"",null,null,null,"",null,null,null,""]
[null,null,null,null,null,null,null,null,null,null,null,null,null,null,null,null,null,null,null,null,null,null,null,null,null,null,null,null,null,null,null,null,null,null,null,null,null,null,null,null,null,null,null,null,null,null,null,null,null,null,null,null,"","",null,null,null,"","",null,null,null,"","",null,null,null,"","",null,null,null,"","",null,null,null,"","",null,null,null,"","",null,null,null,"","",null,null,null,"","",null,null,null,"","",null,null,null,"","",null,null,null,"","",null,null,"","",null,null,"","",null,null,"","",null,null,"","",null,null,"","",null,null,"","",null,null,"","",null,null,"","",null,null,"","",null,null,"","",null,null,"","",null,null,"","",null,null,"","",null,null,"","",null,null,"","",null,null,"","",null,"",null,null,null,null,null,"",null,null,null,null,null,"",null,null,null,"",null,null,null,""]
[null,null,null,null,null,null,null,null,null,null,null,null,null,null,null,null,null,null,null,null,null,null,null,null,null,null,null,null,null,null,null,null,null,null,null,null,null,null,null,null,null,null,null,null,null,null,null,null,null,null,null,null,"","",null,null,null,"","",null,null,null,"","",null,null,null,"","",null,null,null,"","",null,null,null,"","",null,null,null,"","",null,null,null,"","",null,null,null,"","",null,null,null,"","",null,null,null,"","",null,null,null,"","",null,null,"","",null,null,"","",null,null,"","",null,null,"","",null,null,"","",null,null,"","",null,null,"","",null,null,"","",null,null,"","",null,null,"","",null,null,"","",null,null,"","",null,null,"","",null,null,"","",null,null,"","",null,null,"","",null,"",null,null,null,null,null,"",null,null,null,null,null,"",null,null,null,"",null,null,null,""]
[null,null,null,null,null,null,null,null,null,null,null,null,null,null,null,null,null,null,null,null,null,null,null,null,null,null,null,null,null,null,null,null,null,null,null,null,null,null,null,null,null,null,null,null,null,null,null,null,null,null,null,null,"","",null,null,null,"","",null,null,null,"","",null,null,null,"","",null,null,null,"","",null,null,null,"","",null,null,null,"","",null,null,null,"","",null,null,null,"","",null,null,null,"","",null,null,null,"","",null,null,null,"","",null,null,"","",null,null,"","",null,null,"","",null,null,"","",null,null,"","",null,null,"","",null,null,"","",null,null,"","",null,null,"","",null,null,"","",null,null,"","",null,null,"","",null,null,"","",null,null,"","",null,null,"","",null,null,"","",null,"",null,null,null,null,null,"",null,null,null,null,null,"",null,null,null,"",null,null,null,""]
[null,null,null,null,null,null,null,null,null,null,null,null,null,null,null,null,null,null,null,null,null,null,null,null,null,null,null,null,null,null,null,null,null,null,null,null,null,null,null,null,null,null,null,null,null,null,null,null,null,null,null,null,"","",null,null,null,"","",null,null,null,"","",null,null,null,"","",null,null,null,"","",null,null,null,"","",null,null,null,"","",null,null,null,"","",null,null,null,"","",null,null,null,"","",null,null,null,"","",null,null,null,"","",null,null,"","",null,null,"","",null,null,"","",null,null,"","",null,null,"","",null,null,"","",null,null,"","",null,null,"","",null,null,"","",null,null,"","",null,null,"","",null,null,"","",null,null,"","",null,null,"","",null,null,"","",null,null,"","",null,"",null,null,null,null,null,"",null,null,null,null,null,"",null,null,null,"",null,null,null,""]
[null,null,null,null,null,null,null,null,null,null,null,null,null,null,null,null,null,null,null,null,null,null,null,null,null,null,null,null,null,null,null,null,null,null,null,null,null,null,null,null,null,null,null,null,null,null,null,null,null,null,null,null,"","",null,null,null,"","",null,null,null,"","",null,null,null,"","",null,null,null,"","",null,null,null,"","",null,null,null,"","",null,null,null,"","",null,null,null,"","",null,null,null,"","",null,null,null,"","",null,null,null,"","",null,null,"","",null,null,"","",null,null,"","",null,null,"","",null,null,"","",null,null,"","",null,null,"","",null,null,"","",null,null,"","",null,null,"","",null,null,"","",null,null,"","",null,null,"","",null,null,"","",null,null,"","",null,null,"","",null,"",null,null,null,null,null,"",null,null,null,null,null,"",null,null,null,"",null,null,null,""]
[null,null,null,null,null,null,null,null,null,null,null,null,null,null,null,null,null,null,null,null,null,null,null,null,null,null,null,null,null,null,null,null,null,null,null,null,null,null,null,null,null,null,null,null,null,null,null,null,null,null,null,null,"","",null,null,null,"","",null,null,null,"","",null,null,null,"","",null,null,null,"","",null,null,null,"","",null,null,null,"","",null,null,null,"","",null,null,null,"","",null,null,null,"","",null,null,null,"","",null,null,null,"","",null,null,"","",null,null,"","",null,null,"","",null,null,"","",null,null,"","",null,null,"","",null,null,"","",null,null,"","",null,null,"","",null,null,"","",null,null,"","",null,null,"","",null,null,"","",null,null,"","",null,null,"","",null,null,"","",null,"",null,null,null,null,null,"",null,null,null,null,null,"",null,null,null,"",null,null,null,""]
[null,null,null,null,null,null,null,null,null,null,null,null,null,null,null,null,null,null,null,null,null,null,null,null,null,null,null,null,null,null,null,null,null,null,null,null,null,null,null,null,null,null,null,null,null,null,null,null,null,null,null,null,"","",null,null,null,"","",null,null,null,"","",null,null,null,"","",null,null,null,"","",null,null,null,"","",null,null,null,"","",null,null,null,"","",null,null,null,"","",null,null,null,"","",null,null,null,"","",null,null,null,"","",null,null,"","",null,null,"","",null,null,"","",null,null,"","",null,null,"","",null,null,"","",null,null,"","",null,null,"","",null,null,"","",null,null,"","",null,null,"","",null,null,"","",null,null,"","",null,null,"","",null,null,"","",null,null,"","",null,"",null,null,null,null,null,"",null,null,null,null,null,"",null,null,null,"",null,null,null,""]
[null,null,null,null,null,null,null,null,null,null,null,null,null,null,null,null,null,null,null,null,null,null,null,null,null,null,null,null,null,null,null,null,null,null,null,null,null,null,null,null,null,null,null,null,null,null,null,null,null,null,null,null,"","",null,null,null,"","",null,null,null,"","",null,null,null,"","",null,null,null,"","",null,null,null,"","",null,null,null,"","",null,null,null,"","",null,null,null,"","",null,null,null,"","",null,null,null,"","",null,null,null,"","",null,null,"","",null,null,"","",null,null,"","",null,null,"","",null,null,"","",null,null,"","",null,null,"","",null,null,"","",null,null,"","",null,null,"","",null,null,"","",null,null,"","",null,null,"","",null,null,"","",null,null,"","",null,null,"","",null,"",null,null,null,null,null,"",null,null,null,null,null,"",null,null,null,"",null,null,null,""]
[null,null,null,null,null,null,null,null,null,null,null,null,null,null,null,null,null,null,null,null,null,null,null,null,null,null,null,null,null,null,null,null,null,null,null,null,null,null,null,null,null,null,null,null,null,null,null,null,null,null,null,null,{"$f":"IF(ISERROR(VLOOKUP($AZ35,PERCEPCIONES,3,0)),\"\",VLOOKUP($AZ35,PERCEPCIONES,3,0))","v":""},{"$f":"IF(ISERROR(VLOOKUP($AZ35,PERCEPCIONES,2,0)),\"\",VLOOKUP($AZ35,PERCEPCIONES,2,0))","v":""},null,null,null,{"$f":"IF(ISERROR(VLOOKUP($BE35,PERCEPCIONES,3,0)),\"\",VLOOKUP($BE35,PERCEPCIONES,3,0))","v":""},{"$f":"IF(ISERROR(VLOOKUP($BE35,PERCEPCIONES,2,0)),\"\",VLOOKUP($BE35,PERCEPCIONES,2,0))","v":""},null,null,null,{"$f":"IF(ISERROR(VLOOKUP($BJ35,PERCEPCIONES,3,0)),\"\",VLOOKUP($BJ35,PERCEPCIONES,3,0))","v":""},{"$f":"IF(ISERROR(VLOOKUP($BJ35,PERCEPCIONES,2,0)),\"\",VLOOKUP($BJ35,PERCEPCIONES,2,0))","v":""},null,null,null,{"$f":"IF(ISERROR(VLOOKUP($BO35,PERCEPCIONES,3,0)),\"\",VLOOKUP($BO35,PERCEPCIONES,3,0))","v":""},{"$f":"IF(ISERROR(VLOOKUP($BO35,PERCEPCIONES,2,0)),\"\",VLOOKUP($BO35,PERCEPCIONES,2,0))","v":""},null,null,null,{"$f":"IF(ISERROR(VLOOKUP($BT35,PERCEPCIONES,3,0)),\"\",VLOOKUP($BT35,PERCEPCIONES,3,0))","v":""},{"$f":"IF(ISERROR(VLOOKUP($BT35,PERCEPCIONES,2,0)),\"\",VLOOKUP($BT35,PERCEPCIONES,2,0))","v":""},null,null,null,{"$f":"IF(ISERROR(VLOOKUP($BY35,PERCEPCIONES,3,0)),\"\",VLOOKUP($BY35,PERCEPCIONES,3,0))","v":""},{"$f":"IF(ISERROR(VLOOKUP($BY35,PERCEPCIONES,2,0)),\"\",VLOOKUP($BY35,PERCEPCIONES,2,0))","v":""},null,null,null,{"$f":"IF(ISERROR(VLOOKUP($CD35,PERCEPCIONES,3,0)),\"\",VLOOKUP($CD35,PERCEPCIONES,3,0))","v":""},{"$f":"IF(ISERROR(VLOOKUP($CD35,PERCEPCIONES,2,0)),\"\",VLOOKUP($CD35,PERCEPCIONES,2,0))","v":""},null,null,null,{"$f":"IF(ISERROR(VLOOKUP($CI35,PERCEPCIONES,3,0)),\"\",VLOOKUP($CI35,PERCEPCIONES,3,0))","v":""},{"$f":"IF(ISERROR(VLOOKUP($CI35,PERCEPCIONES,2,0)),\"\",VLOOKUP($CI35,PERCEPCIONES,2,0))","v":""},null,null,null,{"$f":"IF(ISERROR(VLOOKUP($CN35,PERCEPCIONES,3,0)),\"\",VLOOKUP($CN35,PERCEPCIONES,3,0))","v":""},{"$f":"IF(ISERROR(VLOOKUP($CN35,PERCEPCIONES,2,0)),\"\",VLOOKUP($CN35,PERCEPCIONES,2,0))","v":""},null,null,null,{"$f":"IF(ISERROR(VLOOKUP($CS35,PERCEPCIONES,3,0)),\"\",VLOOKUP($CS35,PERCEPCIONES,3,0))","v":""},{"$f":"IF(ISERROR(VLOOKUP($CS35,PERCEPCIONES,2,0)),\"\",VLOOKUP($CS35,PERCEPCIONES,2,0))","v":""},null,null,null,{"$f":"IF(ISERROR(VLOOKUP($CX35,PERCEPCIONES,3,0)),\"\",VLOOKUP($CX35,PERCEPCIONES,3,0))","v":""},{"$f":"IF(ISERROR(VLOOKUP($CX35,PERCEPCIONES,2,0)),\"\",VLOOKUP($CX35,PERCEPCIONES,2,0))","v":""},null,null,null,{"$f":"IF(ISERROR(VLOOKUP($DC35,DEDUCCIONES,3,0)),\"\",VLOOKUP($DC35,DEDUCCIONES,3,0))","v":""},{"$f":"IF(ISERROR(VLOOKUP($DC35,DEDUCCIONES,2,0)),\"\",VLOOKUP($DC35,DEDUCCIONES,2,0))","v":""},null,null,{"$f":"IF(ISERROR(VLOOKUP($DG35,DEDUCCIONES,3,0)),\"\",VLOOKUP($DG35,DEDUCCIONES,3,0))","v":""},{"$f":"IF(ISERROR(VLOOKUP($DG35,DEDUCCIONES,2,0)),\"\",VLOOKUP($DG35,DEDUCCIONES,2,0))","v":""},null,null,{"$f":"IF(ISERROR(VLOOKUP($DK35,DEDUCCIONES,3,0)),\"\",VLOOKUP($DK35,DEDUCCIONES,3,0))","v":""},{"$f":"IF(ISERROR(VLOOKUP($DK35,DEDUCCIONES,2,0)),\"\",VLOOKUP($DK35,DEDUCCIONES,2,0))","v":""},null,null,{"$f":"IF(ISERROR(VLOOKUP($DO35,DEDUCCIONES,3,0)),\"\",VLOOKUP($DO35,DEDUCCIONES,3,0))","v":""},{"$f":"IF(ISERROR(VLOOKUP($DO35,DEDUCCIONES,2,0)),\"\",VLOOKUP($DO35,DEDUCCIONES,2,0))","v":""},null,null,{"$f":"IF(ISERROR(VLOOKUP($DS35,DEDUCCIONES,3,0)),\"\",VLOOKUP($DS35,DEDUCCIONES,3,0))","v":""},{"$f":"IF(ISERROR(VLOOKUP($DS35,DEDUCCIONES,2,0)),\"\",VLOOKUP($DS35,DEDUCCIONES,2,0))","v":""},null,null,{"$f":"IF(ISERROR(VLOOKUP($DW35,DEDUCCIONES,3,0)),\"\",VLOOKUP($DW35,DEDUCCIONES,3,0))","v":""},{"$f":"IF(ISERROR(VLOOKUP($DW35,DEDUCCIONES,2,0)),\"\",VLOOKUP($DW35,DEDUCCIONES,2,0))","v":""},null,null,{"$f":"IF(ISERROR(VLOOKUP($EA35,DEDUCCIONES,3,0)),\"\",VLOOKUP($EA35,DEDUCCIONES,3,0))","v":""},{"$f":"IF(ISERROR(VLOOKUP($EA35,DEDUCCIONES,2,0)),\"\",VLOOKUP($EA35,DEDUCCIONES,2,0))","v":""},null,null,{"$f":"IF(ISERROR(VLOOKUP($EE35,DEDUCCIONES,3,0)),\"\",VLOOKUP($EE35,DEDUCCIONES,3,0))","v":""},{"$f":"IF(ISERROR(VLOOKUP($EE35,DEDUCCIONES,2,0)),\"\",VLOOKUP($EE35,DEDUCCIONES,2,0))","v":""},null,null,{"$f":"IF(ISERROR(VLOOKUP($EI35,DEDUCCIONES,3,0)),\"\",VLOOKUP($EI35,DEDUCCIONES,3,0))","v":""},{"$f":"IF(ISERROR(VLOOKUP($EI35,DEDUCCIONES,2,0)),\"\",VLOOKUP($EI35,DEDUCCIONES,2,0))","v":""},null,null,{"$f":"IF(ISERROR(VLOOKUP($EM35,DEDUCCIONES,3,0)),\"\",VLOOKUP($EM35,DEDUCCIONES,3,0))","v":""},{"$f":"IF(ISERROR(VLOOKUP($EM35,DEDUCCIONES,2,0)),\"\",VLOOKUP($EM35,DEDUCCIONES,2,0))","v":""},null,null,{"$f":"IF(ISERROR(VLOOKUP($EQ35,DEDUCCIONES,3,0)),\"\",VLOOKUP($EQ35,DEDUCCIONES,3,0))","v":""},{"$f":"IF(ISERROR(VLOOKUP($EQ35,DEDUCCIONES,2,0)),\"\",VLOOKUP($EQ35,DEDUCCIONES,2,0))","v":""},null,null,{"$f":"IF(ISERROR(VLOOKUP($EU35,DEDUCCIONES,3,0)),\"\",VLOOKUP($EU35,DEDUCCIONES,3,0))","v":""},{"$f":"IF(ISERROR(VLOOKUP($EU35,DEDUCCIONES,2,0)),\"\",VLOOKUP($EU35,DEDUCCIONES,2,0))","v":""},null,null,{"$f":"IF(ISERROR(VLOOKUP($EY35,COD_OTRO_PAGO,3,0)),\"\",VLOOKUP($EY35,COD_OTRO_PAGO,3,0))","v":""},{"$f":"IF(ISERROR(VLOOKUP($EY35,COD_OTRO_PAGO,2,0)),\"\",VLOOKUP($EY35,COD_OTRO_PAGO,2,0))","v":""},null,null,{"$f":"IF(ISERROR(VLOOKUP($FC35,COD_OTRO_PAGO,3,0)),\"\",VLOOKUP($FC35,COD_OTRO_PAGO,3,0))","v":""},{"$f":"IF(ISERROR(VLOOKUP($FC35,COD_OTRO_PAGO,2,0)),\"\",VLOOKUP($FC35,COD_OTRO_PAGO,2,0))","v":""},null,null,{"$f":"IF(ISERROR(VLOOKUP($FG35,COD_OTRO_PAGO,3,0)),\"\",VLOOKUP($FG35,COD_OTRO_PAGO,3,0))","v":""},{"$f":"IF(ISERROR(VLOOKUP($FG35,COD_OTRO_PAGO,2,0)),\"\",VLOOKUP($FG35,COD_OTRO_PAGO,2,0))","v":""},null,null,{"$f":"IF(ISERROR(VLOOKUP($FK35,COD_OTRO_PAGO,3,0)),\"\",VLOOKUP($FK35,COD_OTRO_PAGO,3,0))","v":""},{"$f":"IF(ISERROR(VLOOKUP($FK35,COD_OTRO_PAGO,2,0)),\"\",VLOOKUP($FK35,COD_OTRO_PAGO,2,0))","v":""},null,null,{"$f":"IF(ISERROR(VLOOKUP($FO35,COD_OTRO_PAGO,3,0)),\"\",VLOOKUP($FO35,COD_OTRO_PAGO,3,0))","v":""},{"$f":"IF(ISERROR(VLOOKUP($FO35,COD_OTRO_PAGO,2,0)),\"\",VLOOKUP($FO35,COD_OTRO_PAGO,2,0))","v":""},null,{"$f":"IF(ISERROR(VLOOKUP($FU35,COD_HORAS_EXTRA,3,0)),\"\",VLOOKUP($FU35,COD_HORAS_EXTRA,3,0))","v":""},null,null,null,null,null,{"$f":"IF(ISERROR(VLOOKUP($GA35,COD_HORAS_EXTRA,3,0)),\"\",VLOOKUP($GA35,COD_HORAS_EXTRA,3,0))","v":""},null,null,null,null,null,{"$f":"IF(ISERROR(VLOOKUP($GG35,COD_TIP_INCA,3,0)),\"\",VLOOKUP($GG35,COD_TIP_INCA,3,0))","v":""},null,null,null,{"$f":"IF(ISERROR(VLOOKUP($GK35,COD_TIP_INCA,3,0)),\"\",VLOOKUP($GK35,COD_TIP_INCA,3,0))","v":""},null,null,null,{"$f":"IF(ISERROR(VLOOKUP($GO35,COD_TIP_INCA,3,0)),\"\",VLOOKUP($GO35,COD_TIP_INCA,3,0))","v":""}]
[null,null,null,null,null,null,null,null,null,null,null,null,null,null,null,null,null,null,null,null,null,null,null,null,null,null,null,null,null,null,null,null,null,null,null,null,null,null,null,null,null,null,null,null,null,null,null,null,null,null,null,null,"","",null,null,null,"","",null,null,null,"","",null,null,null,"","",null,null,null,"","",null,null,null,"","",null,null,null,"","",null,null,null,"","",null,null,null,"","",null,null,null,"","",null,null,null,"","",null,null,null,"","",null,null,"","",null,null,"","",null,null,"","",null,null,"","",null,null,"","",null,null,"","",null,null,"","",null,null,"","",null,null,"","",null,null,"","",null,null,"","",null,null,"","",null,null,"","",null,null,"","",null,null,"","",null,null,"","",null,"",null,null,null,null,null,"",null,null,null,null,null,"",null,null,null,"",null,null,null,""]
[null,null,null,null,null,null,null,null,null,null,null,null,null,null,null,null,null,null,null,null,null,null,null,null,null,null,null,null,null,null,null,null,null,null,null,null,null,null,null,null,null,null,null,null,null,null,null,null,null,null,null,null,"","",null,null,null,"","",null,null,null,"","",null,null,null,"","",null,null,null,"","",null,null,null,"","",null,null,null,"","",null,null,null,"","",null,null,null,"","",null,null,null,"","",null,null,null,"","",null,null,null,"","",null,null,"","",null,null,"","",null,null,"","",null,null,"","",null,null,"","",null,null,"","",null,null,"","",null,null,"","",null,null,"","",null,null,"","",null,null,"","",null,null,"","",null,null,"","",null,null,"","",null,null,"","",null,null,"","",null,"",null,null,null,null,null,"",null,null,null,null,null,"",null,null,null,"",null,null,null,""]
[null,null,null,null,null,null,null,null,null,null,null,null,null,null,null,null,null,null,null,null,null,null,null,null,null,null,null,null,null,null,null,null,null,null,null,null,null,null,null,null,null,null,null,null,null,null,null,null,null,null,null,null,"","",null,null,null,"","",null,null,null,"","",null,null,null,"","",null,null,null,"","",null,null,null,"","",null,null,null,"","",null,null,null,"","",null,null,null,"","",null,null,null,"","",null,null,null,"","",null,null,null,"","",null,null,"","",null,null,"","",null,null,"","",null,null,"","",null,null,"","",null,null,"","",null,null,"","",null,null,"","",null,null,"","",null,null,"","",null,null,"","",null,null,"","",null,null,"","",null,null,"","",null,null,"","",null,null,"","",null,"",null,null,null,null,null,"",null,null,null,null,null,"",null,null,null,"",null,null,null,""]
[null,null,null,null,null,null,null,null,null,null,null,null,null,null,null,null,null,null,null,null,null,null,null,null,null,null,null,null,null,null,null,null,null,null,null,null,null,null,null,null,null,null,null,null,null,null,null,null,null,null,null,null,"","",null,null,null,"","",null,null,null,"","",null,null,null,"","",null,null,null,"","",null,null,null,"","",null,null,null,"","",null,null,null,"","",null,null,null,"","",null,null,null,"","",null,null,null,"","",null,null,null,"","",null,null,"","",null,null,"","",null,null,"","",null,null,"","",null,null,"","",null,null,"","",null,null,"","",null,null,"","",null,null,"","",null,null,"","",null,null,"","",null,null,"","",null,null,"","",null,null,"","",null,null,"","",null,null,"","",null,"",null,null,null,null,null,"",null,null,null,null,null,"",null,null,null,"",null,null,null,""]
[null,null,null,null,null,null,null,null,null,null,null,null,null,null,null,null,null,null,null,null,null,null,null,null,null,null,null,null,null,null,null,null,null,null,null,null,null,null,null,null,null,null,null,null,null,null,null,null,null,null,null,null,"","",null,null,null,"","",null,null,null,"","",null,null,null,"","",null,null,null,"","",null,null,null,"","",null,null,null,"","",null,null,null,"","",null,null,null,"","",null,null,null,"","",null,null,null,"","",null,null,null,"","",null,null,"","",null,null,"","",null,null,"","",null,null,"","",null,null,"","",null,null,"","",null,null,"","",null,null,"","",null,null,"","",null,null,"","",null,null,"","",null,null,"","",null,null,"","",null,null,"","",null,null,"","",null,null,"","",null,"",null,null,null,null,null,"",null,null,null,null,null,"",null,null,null,"",null,null,null,""]
[null,null,null,null,null,null,null,null,null,null,null,null,null,null,null,null,null,null,null,null,null,null,null,null,null,null,null,null,null,null,null,null,null,null,null,null,null,null,null,null,null,null,null,null,null,null,null,null,null,null,null,null,"","",null,null,null,"","",null,null,null,"","",null,null,null,"","",null,null,null,"","",null,null,null,"","",null,null,null,"","",null,null,null,"","",null,null,null,"","",null,null,null,"","",null,null,null,"","",null,null,null,"","",null,null,"","",null,null,"","",null,null,"","",null,null,"","",null,null,"","",null,null,"","",null,null,"","",null,null,"","",null,null,"","",null,null,"","",null,null,"","",null,null,"","",null,null,"","",null,null,"","",null,null,"","",null,null,"","",null,"",null,null,null,null,null,"",null,null,null,null,null,"",null,null,null,"",null,null,null,""]
[null,null,null,null,null,null,null,null,null,null,null,null,null,null,null,null,null,null,null,null,null,null,null,null,null,null,null,null,null,null,null,null,null,null,null,null,null,null,null,null,null,null,null,null,null,null,null,null,null,null,null,null,"","",null,null,null,"","",null,null,null,"","",null,null,null,"","",null,null,null,"","",null,null,null,"","",null,null,null,"","",null,null,null,"","",null,null,null,"","",null,null,null,"","",null,null,null,"","",null,null,null,"","",null,null,"","",null,null,"","",null,null,"","",null,null,"","",null,null,"","",null,null,"","",null,null,"","",null,null,"","",null,null,"","",null,null,"","",null,null,"","",null,null,"","",null,null,"","",null,null,"","",null,null,"","",null,null,"","",null,"",null,null,null,null,null,"",null,null,null,null,null,"",null,null,null,"",null,null,null,""]
[null,null,null,null,null,null,null,null,null,null,null,null,null,null,null,null,null,null,null,null,null,null,null,null,null,null,null,null,null,null,null,null,null,null,null,null,null,null,null,null,null,null,null,null,null,null,null,null,null,null,null,null,"","",null,null,null,"","",null,null,null,"","",null,null,null,"","",null,null,null,"","",null,null,null,"","",null,null,null,"","",null,null,null,"","",null,null,null,"","",null,null,null,"","",null,null,null,"","",null,null,null,"","",null,null,"","",null,null,"","",null,null,"","",null,null,"","",null,null,"","",null,null,"","",null,null,"","",null,null,"","",null,null,"","",null,null,"","",null,null,"","",null,null,"","",null,null,"","",null,null,"","",null,null,"","",null,null,"","",null,"",null,null,null,null,null,"",null,null,null,null,null,"",null,null,null,"",null,null,null,""]
[null,null,null,null,null,null,null,null,null,null,null,null,null,null,null,null,null,null,null,null,null,null,null,null,null,null,null,null,null,null,null,null,null,null,null,null,null,null,null,null,null,null,null,null,null,null,null,null,null,null,null,null,"","",null,null,null,"","",null,null,null,"","",null,null,null,"","",null,null,null,"","",null,null,null,"","",null,null,null,"","",null,null,null,"","",null,null,null,"","",null,null,null,"","",null,null,null,"","",null,null,null,"","",null,null,"","",null,null,"","",null,null,"","",null,null,"","",null,null,"","",null,null,"","",null,null,"","",null,null,"","",null,null,"","",null,null,"","",null,null,"","",null,null,"","",null,null,"","",null,null,"","",null,null,"","",null,null,"","",null,"",null,null,null,null,null,"",null,null,null,null,null,"",null,null,null,"",null,null,null,""]
[null,null,null,null,null,null,null,null,null,null,null,null,null,null,null,null,null,null,null,null,null,null,null,null,null,null,null,null,null,null,null,null,null,null,null,null,null,null,null,null,null,null,null,null,null,null,null,null,null,null,null,null,"","",null,null,null,"","",null,null,null,"","",null,null,null,"","",null,null,null,"","",null,null,null,"","",null,null,null,"","",null,null,null,"","",null,null,null,"","",null,null,null,"","",null,null,null,"","",null,null,null,"","",null,null,"","",null,null,"","",null,null,"","",null,null,"","",null,null,"","",null,null,"","",null,null,"","",null,null,"","",null,null,"","",null,null,"","",null,null,"","",null,null,"","",null,null,"","",null,null,"","",null,null,"","",null,null,"","",null,"",null,null,null,null,null,"",null,null,null,null,null,"",null,null,null,"",null,null,null,""]
[null,null,null,null,null,null,null,null,null,null,null,null,null,null,null,null,null,null,null,null,null,null,null,null,null,null,null,null,null,null,null,null,null,null,null,null,null,null,null,null,null,null,null,null,null,null,null,null,null,null,null,null,"","",null,null,null,"","",null,null,null,"","",null,null,null,"","",null,null,null,"","",null,null,null,"","",null,null,null,"","",null,null,null,"","",null,null,null,"","",null,null,null,"","",null,null,null,"","",null,null,null,"","",null,null,"","",null,null,"","",null,null,"","",null,null,"","",null,null,"","",null,null,"","",null,null,"","",null,null,"","",null,null,"","",null,null,"","",null,null,"","",null,null,"","",null,null,"","",null,null,"","",null,null,"","",null,null,"","",null,"",null,null,null,null,null,"",null,null,null,null,null,"",null,null,null,"",null,null,null,""]
[null,null,null,null,null,null,null,null,null,null,null,null,null,null,null,null,null,null,null,null,null,null,null,null,null,null,null,null,null,null,null,null,null,null,null,null,null,null,null,null,null,null,null,null,null,null,null,null,null,null,null,null,"","",null,null,null,"","",null,null,null,"","",null,null,null,"","",null,null,null,"","",null,null,null,"","",null,null,null,"","",null,null,null,"","",null,null,null,"","",null,null,null,"","",null,null,null,"","",null,null,null,"","",null,null,"","",null,null,"","",null,null,"","",null,null,"","",null,null,"","",null,null,"","",null,null,"","",null,null,"","",null,null,"","",null,null,"","",null,null,"","",null,null,"","",null,null,"","",null,null,"","",null,null,"","",null,null,"","",null,"",null,null,null,null,null,"",null,null,null,null,null,"",null,null,null,"",null,null,null,""]
[null,null,null,null,null,null,null,null,null,null,null,null,null,null,null,null,null,null,null,null,null,null,null,null,null,null,null,null,null,null,null,null,null,null,null,null,null,null,null,null,null,null,null,null,null,null,null,null,null,null,null,null,"","",null,null,null,"","",null,null,null,"","",null,null,null,"","",null,null,null,"","",null,null,null,"","",null,null,null,"","",null,null,null,"","",null,null,null,"","",null,null,null,"","",null,null,null,"","",null,null,null,"","",null,null,"","",null,null,"","",null,null,"","",null,null,"","",null,null,"","",null,null,"","",null,null,"","",null,null,"","",null,null,"","",null,null,"","",null,null,"","",null,null,"","",null,null,"","",null,null,"","",null,null,"","",null,null,"","",null,"",null,null,null,null,null,"",null,null,null,null,null,"",null,null,null,"",null,null,null,""]
[null,null,null,null,null,null,null,null,null,null,null,null,null,null,null,null,null,null,null,null,null,null,null,null,null,null,null,null,null,null,null,null,null,null,null,null,null,null,null,null,null,null,null,null,null,null,null,null,null,null,null,null,"","",null,null,null,"","",null,null,null,"","",null,null,null,"","",null,null,null,"","",null,null,null,"","",null,null,null,"","",null,null,null,"","",null,null,null,"","",null,null,null,"","",null,null,null,"","",null,null,null,"","",null,null,"","",null,null,"","",null,null,"","",null,null,"","",null,null,"","",null,null,"","",null,null,"","",null,null,"","",null,null,"","",null,null,"","",null,null,"","",null,null,"","",null,null,"","",null,null,"","",null,null,"","",null,null,"","",null,"",null,null,null,null,null,"",null,null,null,null,null,"",null,null,null,"",null,null,null,""]
[null,null,null,null,null,null,null,null,null,null,null,null,null,null,null,null,null,null,null,null,null,null,null,null,null,null,null,null,null,null,null,null,null,null,null,null,null,null,null,null,null,null,null,null,null,null,null,null,null,null,null,null,"","",null,null,null,"","",null,null,null,"","",null,null,null,"","",null,null,null,"","",null,null,null,"","",null,null,null,"","",null,null,null,"","",null,null,null,"","",null,null,null,"","",null,null,null,"","",null,null,null,"","",null,null,"","",null,null,"","",null,null,"","",null,null,"","",null,null,"","",null,null,"","",null,null,"","",null,null,"","",null,null,"","",null,null,"","",null,null,"","",null,null,"","",null,null,"","",null,null,"","",null,null,"","",null,null,"","",null,"",null,null,null,null,null,"",null,null,null,null,null,"",null,null,null,"",null,null,null,""]
[null,null,null,null,null,null,null,null,null,null,null,null,null,null,null,null,null,null,null,null,null,null,null,null,null,null,null,null,null,null,null,null,null,null,null,null,null,null,null,null,null,null,null,null,null,null,null,null,null,null,null,null,"","",null,null,null,"","",null,null,null,"","",null,null,null,"","",null,null,null,"","",null,null,null,"","",null,null,null,"","",null,null,null,"","",null,null,null,"","",null,null,null,"","",null,null,null,"","",null,null,null,"","",null,null,"","",null,null,"","",null,null,"","",null,null,"","",null,null,"","",null,null,"","",null,null,"","",null,null,"","",null,null,"","",null,null,"","",null,null,"","",null,null,"","",null,null,"","",null,null,"","",null,null,"","",null,null,"","",null,"",null,null,null,null,null,"",null,null,null,null,null,"",null,null,null,"",null,null,null,""]
[null,null,null,null,null,null,null,null,null,null,null,null,null,null,null,null,null,null,null,null,null,null,null,null,null,null,null,null,null,null,null,null,null,null,null,null,null,null,null,null,null,null,null,null,null,null,null,null,null,null,null,null,"","",null,null,null,"","",null,null,null,"","",null,null,null,"","",null,null,null,"","",null,null,null,"","",null,null,null,"","",null,null,null,"","",null,null,null,"","",null,null,null,"","",null,null,null,"","",null,null,null,"","",null,null,"","",null,null,"","",null,null,"","",null,null,"","",null,null,"","",null,null,"","",null,null,"","",null,null,"","",null,null,"","",null,null,"","",null,null,"","",null,null,"","",null,null,"","",null,null,"","",null,null,"","",null,null,"","",null,"",null,null,null,null,null,"",null,null,null,null,null,"",null,null,null,"",null,null,null,""]
[null,null,null,null,null,null,null,null,null,null,null,null,null,null,null,null,null,null,null,null,null,null,null,null,null,null,null,null,null,null,null,null,null,null,null,null,null,null,null,null,null,null,null,null,null,null,null,null,null,null,null,null,"","",null,null,null,"","",null,null,null,"","",null,null,null,"","",null,null,null,"","",null,null,null,"","",null,null,null,"","",null,null,null,"","",null,null,null,"","",null,null,null,"","",null,null,null,"","",null,null,null,"","",null,null,"","",null,null,"","",null,null,"","",null,null,"","",null,null,"","",null,null,"","",null,null,"","",null,null,"","",null,null,"","",null,null,"","",null,null,"","",null,null,"","",null,null,"","",null,null,"","",null,null,"","",null,null,"","",null,"",null,null,null,null,null,"",null,null,null,null,null,"",null,null,null,"",null,null,null,""]
[null,null,null,null,null,null,null,null,null,null,null,null,null,null,null,null,null,null,null,null,null,null,null,null,null,null,null,null,null,null,null,null,null,null,null,null,null,null,null,null,null,null,null,null,null,null,null,null,null,null,null,null,"","",null,null,null,"","",null,null,null,"","",null,null,null,"","",null,null,null,"","",null,null,null,"","",null,null,null,"","",null,null,null,"","",null,null,null,"","",null,null,null,"","",null,null,null,"","",null,null,null,"","",null,null,"","",null,null,"","",null,null,"","",null,null,"","",null,null,"","",null,null,"","",null,null,"","",null,null,"","",null,null,"","",null,null,"","",null,null,"","",null,null,"","",null,null,"","",null,null,"","",null,null,"","",null,null,"","",null,"",null,null,null,null,null,"",null,null,null,null,null,"",null,null,null,"",null,null,null,""]
[null,null,null,null,null,null,null,null,null,null,null,null,null,null,null,null,null,null,null,null,null,null,null,null,null,null,null,null,null,null,null,null,null,null,null,null,null,null,null,null,null,null,null,null,null,null,null,null,null,null,null,null,"","",null,null,null,"","",null,null,null,"","",null,null,null,"","",null,null,null,"","",null,null,null,"","",null,null,null,"","",null,null,null,"","",null,null,null,"","",null,null,null,"","",null,null,null,"","",null,null,null,"","",null,null,"","",null,null,"","",null,null,"","",null,null,"","",null,null,"","",null,null,"","",null,null,"","",null,null,"","",null,null,"","",null,null,"","",null,null,"","",null,null,"","",null,null,"","",null,null,"","",null,null,"","",null,null,"","",null,"",null,null,null,null,null,"",null,null,null,null,null,"",null,null,null,"",null,null,null,""]
[null,null,null,null,null,null,null,null,null,null,null,null,null,null,null,null,null,null,null,null,null,null,null,null,null,null,null,null,null,null,null,null,null,null,null,null,null,null,null,null,null,null,null,null,null,null,null,null,null,null,null,null,"","",null,null,null,"","",null,null,null,"","",null,null,null,"","",null,null,null,"","",null,null,null,"","",null,null,null,"","",null,null,null,"","",null,null,null,"","",null,null,null,"","",null,null,null,"","",null,null,null,"","",null,null,"","",null,null,"","",null,null,"","",null,null,"","",null,null,"","",null,null,"","",null,null,"","",null,null,"","",null,null,"","",null,null,"","",null,null,"","",null,null,"","",null,null,"","",null,null,"","",null,null,"","",null,null,"","",null,"",null,null,null,null,null,"",null,null,null,null,null,"",null,null,null,"",null,null,null,""]
[null,null,null,null,null,null,null,null,null,null,null,null,null,null,null,null,null,null,null,null,null,null,null,null,null,null,null,null,null,null,null,null,null,null,null,null,null,null,null,null,null,null,null,null,null,null,null,null,null,null,null,null,"","",null,null,null,"","",null,null,null,"","",null,null,null,"","",null,null,null,"","",null,null,null,"","",null,null,null,"","",null,null,null,"","",null,null,null,"","",null,null,null,"","",null,null,null,"","",null,null,null,"","",null,null,"","",null,null,"","",null,null,"","",null,null,"","",null,null,"","",null,null,"","",null,null,"","",null,null,"","",null,null,"","",null,null,"","",null,null,"","",null,null,"","",null,null,"","",null,null,"","",null,null,"","",null,null,"","",null,"",null,null,null,null,null,"",null,null,null,null,null,"",null,null,null,"",null,null,null,""]
[null,null,null,null,null,null,null,null,null,null,null,null,null,null,null,null,null,null,null,null,null,null,null,null,null,null,null,null,null,null,null,null,null,null,null,null,null,null,null,null,null,null,null,null,null,null,null,null,null,null,null,null,"","",null,null,null,"","",null,null,null,"","",null,null,null,"","",null,null,null,"","",null,null,null,"","",null,null,null,"","",null,null,null,"","",null,null,null,"","",null,null,null,"","",null,null,null,"","",null,null,null,"","",null,null,"","",null,null,"","",null,null,"","",null,null,"","",null,null,"","",null,null,"","",null,null,"","",null,null,"","",null,null,"","",null,null,"","",null,null,"","",null,null,"","",null,null,"","",null,null,"","",null,null,"","",null,null,"","",null,"",null,null,null,null,null,"",null,null,null,null,null,"",null,null,null,"",null,null,null,""]
[null,null,null,null,null,null,null,null,null,null,null,null,null,null,null,null,null,null,null,null,null,null,null,null,null,null,null,null,null,null,null,null,null,null,null,null,null,null,null,null,null,null,null,null,null,null,null,null,null,null,null,null,"","",null,null,null,"","",null,null,null,"","",null,null,null,"","",null,null,null,"","",null,null,null,"","",null,null,null,"","",null,null,null,"","",null,null,null,"","",null,null,null,"","",null,null,null,"","",null,null,null,"","",null,null,"","",null,null,"","",null,null,"","",null,null,"","",null,null,"","",null,null,"","",null,null,"","",null,null,"","",null,null,"","",null,null,"","",null,null,"","",null,null,"","",null,null,"","",null,null,"","",null,null,"","",null,null,"","",null,"",null,null,null,null,null,"",null,null,null,null,null,"",null,null,null,"",null,null,null,""]
[null,null,null,null,null,null,null,null,null,null,null,null,null,null,null,null,null,null,null,null,null,null,null,null,null,null,null,null,null,null,null,null,null,null,null,null,null,null,null,null,null,null,null,null,null,null,null,null,null,null,null,null,"","",null,null,null,"","",null,null,null,"","",null,null,null,"","",null,null,null,"","",null,null,null,"","",null,null,null,"","",null,null,null,"","",null,null,null,"","",null,null,null,"","",null,null,null,"","",null,null,null,"","",null,null,"","",null,null,"","",null,null,"","",null,null,"","",null,null,"","",null,null,"","",null,null,"","",null,null,"","",null,null,"","",null,null,"","",null,null,"","",null,null,"","",null,null,"","",null,null,"","",null,null,"","",null,null,"","",null,"",null,null,null,null,null,"",null,null,null,null,null,"",null,null,null,"",null,null,null,""]
[null,null,null,null,null,null,null,null,null,null,null,null,null,null,null,null,null,null,null,null,null,null,null,null,null,null,null,null,null,null,null,null,null,null,null,null,null,null,null,null,null,null,null,null,null,null,null,null,null,null,null,null,"","",null,null,null,"","",null,null,null,"","",null,null,null,"","",null,null,null,"","",null,null,null,"","",null,null,null,"","",null,null,null,"","",null,null,null,"","",null,null,null,"","",null,null,null,"","",null,null,null,"","",null,null,"","",null,null,"","",null,null,"","",null,null,"","",null,null,"","",null,null,"","",null,null,"","",null,null,"","",null,null,"","",null,null,"","",null,null,"","",null,null,"","",null,null,"","",null,null,"","",null,null,"","",null,null,"","",null,"",null,null,null,null,null,"",null,null,null,null,null,"",null,null,null,"",null,null,null,""]
[null,null,null,null,null,null,null,null,null,null,null,null,null,null,null,null,null,null,null,null,null,null,null,null,null,null,null,null,null,null,null,null,null,null,null,null,null,null,null,null,null,null,null,null,null,null,null,null,null,null,null,null,"","",null,null,null,"","",null,null,null,"","",null,null,null,"","",null,null,null,"","",null,null,null,"","",null,null,null,"","",null,null,null,"","",null,null,null,"","",null,null,null,"","",null,null,null,"","",null,null,null,"","",null,null,"","",null,null,"","",null,null,"","",null,null,"","",null,null,"","",null,null,"","",null,null,"","",null,null,"","",null,null,"","",null,null,"","",null,null,"","",null,null,"","",null,null,"","",null,null,"","",null,null,"","",null,null,"","",null,"",null,null,null,null,null,"",null,null,null,null,null,"",null,null,null,"",null,null,null,""]
[null,null,null,null,null,null,null,null,null,null,null,null,null,null,null,null,null,null,null,null,null,null,null,null,null,null,null,null,null,null,null,null,null,null,null,null,null,null,null,null,null,null,null,null,null,null,null,null,null,null,null,null,"","",null,null,null,"","",null,null,null,"","",null,null,null,"","",null,null,null,"","",null,null,null,"","",null,null,null,"","",null,null,null,"","",null,null,null,"","",null,null,null,"","",null,null,null,"","",null,null,null,"","",null,null,"","",null,null,"","",null,null,"","",null,null,"","",null,null,"","",null,null,"","",null,null,"","",null,null,"","",null,null,"","",null,null,"","",null,null,"","",null,null,"","",null,null,"","",null,null,"","",null,null,"","",null,null,"","",null,"",null,null,null,null,null,"",null,null,null,null,null,"",null,null,null,"",null,null,null,""]
[null,null,null,null,null,null,null,null,null,null,null,null,null,null,null,null,null,null,null,null,null,null,null,null,null,null,null,null,null,null,null,null,null,null,null,null,null,null,null,null,null,null,null,null,null,null,null,null,null,null,null,null,"","",null,null,null,"","",null,null,null,"","",null,null,null,"","",null,null,null,"","",null,null,null,"","",null,null,null,"","",null,null,null,"","",null,null,null,"","",null,null,null,"","",null,null,null,"","",null,null,null,"","",null,null,"","",null,null,"","",null,null,"","",null,null,"","",null,null,"","",null,null,"","",null,null,"","",null,null,"","",null,null,"","",null,null,"","",null,null,"","",null,null,"","",null,null,"","",null,null,"","",null,null,"","",null,null,"","",null,"",null,null,null,null,null,"",null,null,null,null,null,"",null,null,null,"",null,null,null,""]
[null,null,null,null,null,null,null,null,null,null,null,null,null,null,null,null,null,null,null,null,null,null,null,null,null,null,null,null,null,null,null,null,null,null,null,null,null,null,null,null,null,null,null,null,null,null,null,null,null,null,null,null,"","",null,null,null,"","",null,null,null,"","",null,null,null,"","",null,null,null,"","",null,null,null,"","",null,null,null,"","",null,null,null,"","",null,null,null,"","",null,null,null,"","",null,null,null,"","",null,null,null,"","",null,null,"","",null,null,"","",null,null,"","",null,null,"","",null,null,"","",null,null,"","",null,null,"","",null,null,"","",null,null,"","",null,null,"","",null,null,"","",null,null,"","",null,null,"","",null,null,"","",null,null,"","",null,null,"","",null,"",null,null,null,null,null,"",null,null,null,null,null,"",null,null,null,"",null,null,null,""]
[null,null,null,null,null,null,null,null,null,null,null,null,null,null,null,null,null,null,null,null,null,null,null,null,null,null,null,null,null,null,null,null,null,null,null,null,null,null,null,null,null,null,null,null,null,null,null,null,null,null,null,null,"","",null,null,null,"","",null,null,null,"","",null,null,null,"","",null,null,null,"","",null,null,null,"","",null,null,null,"","",null,null,null,"","",null,null,null,"","",null,null,null,"","",null,null,null,"","",null,null,null,"","",null,null,"","",null,null,"","",null,null,"","",null,null,"","",null,null,"","",null,null,"","",null,null,"","",null,null,"","",null,null,"","",null,null,"","",null,null,"","",null,null,"","",null,null,"","",null,null,"","",null,null,"","",null,null,"","",null,"",null,null,null,null,null,"",null,null,null,null,null,"",null,null,null,"",null,null,null,""]
[null,null,null,null,null,null,null,null,null,null,null,null,null,null,null,null,null,null,null,null,null,null,null,null,null,null,null,null,null,null,null,null,null,null,null,null,null,null,null,null,null,null,null,null,null,null,null,null,null,null,null,null,{"$f":"IF(ISERROR(VLOOKUP($AZ67,PERCEPCIONES,3,0)),\"\",VLOOKUP($AZ67,PERCEPCIONES,3,0))","v":""},{"$f":"IF(ISERROR(VLOOKUP($AZ67,PERCEPCIONES,2,0)),\"\",VLOOKUP($AZ67,PERCEPCIONES,2,0))","v":""},null,null,null,{"$f":"IF(ISERROR(VLOOKUP($BE67,PERCEPCIONES,3,0)),\"\",VLOOKUP($BE67,PERCEPCIONES,3,0))","v":""},{"$f":"IF(ISERROR(VLOOKUP($BE67,PERCEPCIONES,2,0)),\"\",VLOOKUP($BE67,PERCEPCIONES,2,0))","v":""},null,null,null,{"$f":"IF(ISERROR(VLOOKUP($BJ67,PERCEPCIONES,3,0)),\"\",VLOOKUP($BJ67,PERCEPCIONES,3,0))","v":""},{"$f":"IF(ISERROR(VLOOKUP($BJ67,PERCEPCIONES,2,0)),\"\",VLOOKUP($BJ67,PERCEPCIONES,2,0))","v":""},null,null,null,{"$f":"IF(ISERROR(VLOOKUP($BO67,PERCEPCIONES,3,0)),\"\",VLOOKUP($BO67,PERCEPCIONES,3,0))","v":""},{"$f":"IF(ISERROR(VLOOKUP($BO67,PERCEPCIONES,2,0)),\"\",VLOOKUP($BO67,PERCEPCIONES,2,0))","v":""},null,null,null,{"$f":"IF(ISERROR(VLOOKUP($BT67,PERCEPCIONES,3,0)),\"\",VLOOKUP($BT67,PERCEPCIONES,3,0))","v":""},{"$f":"IF(ISERROR(VLOOKUP($BT67,PERCEPCIONES,2,0)),\"\",VLOOKUP($BT67,PERCEPCIONES,2,0))","v":""},null,null,null,{"$f":"IF(ISERROR(VLOOKUP($BY67,PERCEPCIONES,3,0)),\"\",VLOOKUP($BY67,PERCEPCIONES,3,0))","v":""},{"$f":"IF(ISERROR(VLOOKUP($BY67,PERCEPCIONES,2,0)),\"\",VLOOKUP($BY67,PERCEPCIONES,2,0))","v":""},null,null,null,{"$f":"IF(ISERROR(VLOOKUP($CD67,PERCEPCIONES,3,0)),\"\",VLOOKUP($CD67,PERCEPCIONES,3,0))","v":""},{"$f":"IF(ISERROR(VLOOKUP($CD67,PERCEPCIONES,2,0)),\"\",VLOOKUP($CD67,PERCEPCIONES,2,0))","v":""},null,null,null,{"$f":"IF(ISERROR(VLOOKUP($CI67,PERCEPCIONES,3,0)),\"\",VLOOKUP($CI67,PERCEPCIONES,3,0))","v":""},{"$f":"IF(ISERROR(VLOOKUP($CI67,PERCEPCIONES,2,0)),\"\",VLOOKUP($CI67,PERCEPCIONES,2,0))","v":""},null,null,null,{"$f":"IF(ISERROR(VLOOKUP($CN67,PERCEPCIONES,3,0)),\"\",VLOOKUP($CN67,PERCEPCIONES,3,0))","v":""},{"$f":"IF(ISERROR(VLOOKUP($CN67,PERCEPCIONES,2,0)),\"\",VLOOKUP($CN67,PERCEPCIONES,2,0))","v":""},null,null,null,{"$f":"IF(ISERROR(VLOOKUP($CS67,PERCEPCIONES,3,0)),\"\",VLOOKUP($CS67,PERCEPCIONES,3,0))","v":""},{"$f":"IF(ISERROR(VLOOKUP($CS67,PERCEPCIONES,2,0)),\"\",VLOOKUP($CS67,PERCEPCIONES,2,0))","v":""},null,null,null,{"$f":"IF(ISERROR(VLOOKUP($CX67,PERCEPCIONES,3,0)),\"\",VLOOKUP($CX67,PERCEPCIONES,3,0))","v":""},{"$f":"IF(ISERROR(VLOOKUP($CX67,PERCEPCIONES,2,0)),\"\",VLOOKUP($CX67,PERCEPCIONES,2,0))","v":""},null,null,null,{"$f":"IF(ISERROR(VLOOKUP($DC67,DEDUCCIONES,3,0)),\"\",VLOOKUP($DC67,DEDUCCIONES,3,0))","v":""},{"$f":"IF(ISERROR(VLOOKUP($DC67,DEDUCCIONES,2,0)),\"\",VLOOKUP($DC67,DEDUCCIONES,2,0))","v":""},null,null,{"$f":"IF(ISERROR(VLOOKUP($DG67,DEDUCCIONES,3,0)),\"\",VLOOKUP($DG67,DEDUCCIONES,3,0))","v":""},{"$f":"IF(ISERROR(VLOOKUP($DG67,DEDUCCIONES,2,0)),\"\",VLOOKUP($DG67,DEDUCCIONES,2,0))","v":""},null,null,{"$f":"IF(ISERROR(VLOOKUP($DK67,DEDUCCIONES,3,0)),\"\",VLOOKUP($DK67,DEDUCCIONES,3,0))","v":""},{"$f":"IF(ISERROR(VLOOKUP($DK67,DEDUCCIONES,2,0)),\"\",VLOOKUP($DK67,DEDUCCIONES,2,0))","v":""},null,null,{"$f":"IF(ISERROR(VLOOKUP($DO67,DEDUCCIONES,3,0)),\"\",VLOOKUP($DO67,DEDUCCIONES,3,0))","v":""},{"$f":"IF(ISERROR(VLOOKUP($DO67,DEDUCCIONES,2,0)),\"\",VLOOKUP($DO67,DEDUCCIONES,2,0))","v":""},null,null,{"$f":"IF(ISERROR(VLOOKUP($DS67,DEDUCCIONES,3,0)),\"\",VLOOKUP($DS67,DEDUCCIONES,3,0))","v":""},{"$f":"IF(ISERROR(VLOOKUP($DS67,DEDUCCIONES,2,0)),\"\",VLOOKUP($DS67,DEDUCCIONES,2,0))","v":""},null,null,{"$f":"IF(ISERROR(VLOOKUP($DW67,DEDUCCIONES,3,0)),\"\",VLOOKUP($DW67,DEDUCCIONES,3,0))","v":""},{"$f":"IF(ISERROR(VLOOKUP($DW67,DEDUCCIONES,2,0)),\"\",VLOOKUP($DW67,DEDUCCIONES,2,0))","v":""},null,null,{"$f":"IF(ISERROR(VLOOKUP($EA67,DEDUCCIONES,3,0)),\"\",VLOOKUP($EA67,DEDUCCIONES,3,0))","v":""},{"$f":"IF(ISERROR(VLOOKUP($EA67,DEDUCCIONES,2,0)),\"\",VLOOKUP($EA67,DEDUCCIONES,2,0))","v":""},null,null,{"$f":"IF(ISERROR(VLOOKUP($EE67,DEDUCCIONES,3,0)),\"\",VLOOKUP($EE67,DEDUCCIONES,3,0))","v":""},{"$f":"IF(ISERROR(VLOOKUP($EE67,DEDUCCIONES,2,0)),\"\",VLOOKUP($EE67,DEDUCCIONES,2,0))","v":""},null,null,{"$f":"IF(ISERROR(VLOOKUP($EI67,DEDUCCIONES,3,0)),\"\",VLOOKUP($EI67,DEDUCCIONES,3,0))","v":""},{"$f":"IF(ISERROR(VLOOKUP($EI67,DEDUCCIONES,2,0)),\"\",VLOOKUP($EI67,DEDUCCIONES,2,0))","v":""},null,null,{"$f":"IF(ISERROR(VLOOKUP($EM67,DEDUCCIONES,3,0)),\"\",VLOOKUP($EM67,DEDUCCIONES,3,0))","v":""},{"$f":"IF(ISERROR(VLOOKUP($EM67,DEDUCCIONES,2,0)),\"\",VLOOKUP($EM67,DEDUCCIONES,2,0))","v":""},null,null,{"$f":"IF(ISERROR(VLOOKUP($EQ67,DEDUCCIONES,3,0)),\"\",VLOOKUP($EQ67,DEDUCCIONES,3,0))","v":""},{"$f":"IF(ISERROR(VLOOKUP($EQ67,DEDUCCIONES,2,0)),\"\",VLOOKUP($EQ67,DEDUCCIONES,2,0))","v":""},null,null,{"$f":"IF(ISERROR(VLOOKUP($EU67,DEDUCCIONES,3,0)),\"\",VLOOKUP($EU67,DEDUCCIONES,3,0))","v":""},{"$f":"IF(ISERROR(VLOOKUP($EU67,DEDUCCIONES,2,0)),\"\",VLOOKUP($EU67,DEDUCCIONES,2,0))","v":""},null,null,{"$f":"IF(ISERROR(VLOOKUP($EY67,COD_OTRO_PAGO,3,0)),\"\",VLOOKUP($EY67,COD_OTRO_PAGO,3,0))","v":""},{"$f":"IF(ISERROR(VLOOKUP($EY67,COD_OTRO_PAGO,2,0)),\"\",VLOOKUP($EY67,COD_OTRO_PAGO,2,0))","v":""},null,null,{"$f":"IF(ISERROR(VLOOKUP($FC67,COD_OTRO_PAGO,3,0)),\"\",VLOOKUP($FC67,COD_OTRO_PAGO,3,0))","v":""},{"$f":"IF(ISERROR(VLOOKUP($FC67,COD_OTRO_PAGO,2,0)),\"\",VLOOKUP($FC67,COD_OTRO_PAGO,2,0))","v":""},null,null,{"$f":"IF(ISERROR(VLOOKUP($FG67,COD_OTRO_PAGO,3,0)),\"\",VLOOKUP($FG67,COD_OTRO_PAGO,3,0))","v":""},{"$f":"IF(ISERROR(VLOOKUP($FG67,COD_OTRO_PAGO,2,0)),\"\",VLOOKUP($FG67,COD_OTRO_PAGO,2,0))","v":""},null,null,{"$f":"IF(ISERROR(VLOOKUP($FK67,COD_OTRO_PAGO,3,0)),\"\",VLOOKUP($FK67,COD_OTRO_PAGO,3,0))","v":""},{"$f":"IF(ISERROR(VLOOKUP($FK67,COD_OTRO_PAGO,2,0)),\"\",VLOOKUP($FK67,COD_OTRO_PAGO,2,0))","v":""},null,null,{"$f":"IF(ISERROR(VLOOKUP($FO67,COD_OTRO_PAGO,3,0)),\"\",VLOOKUP($FO67,COD_OTRO_PAGO,3,0))","v":""},{"$f":"IF(ISERROR(VLOOKUP($FO67,COD_OTRO_PAGO,2,0)),\"\",VLOOKUP($FO67,COD_OTRO_PAGO,2,0))","v":""},null,{"$f":"IF(ISERROR(VLOOKUP($FU67,COD_HORAS_EXTRA,3,0)),\"\",VLOOKUP($FU67,COD_HORAS_EXTRA,3,0))","v":""},null,null,null,null,null,{"$f":"IF(ISERROR(VLOOKUP($GA67,COD_HORAS_EXTRA,3,0)),\"\",VLOOKUP($GA67,COD_HORAS_EXTRA,3,0))","v":""},null,null,null,null,null,{"$f":"IF(ISERROR(VLOOKUP($GG67,COD_TIP_INCA,3,0)),\"\",VLOOKUP($GG67,COD_TIP_INCA,3,0))","v":""},null,null,null,{"$f":"IF(ISERROR(VLOOKUP($GK67,COD_TIP_INCA,3,0)),\"\",VLOOKUP($GK67,COD_TIP_INCA,3,0))","v":""},null,null,null,{"$f":"IF(ISERROR(VLOOKUP($GO67,COD_TIP_INCA,3,0)),\"\",VLOOKUP($GO67,COD_TIP_INCA,3,0))","v":""}]
[null,null,null,null,null,null,null,null,null,null,null,null,null,null,null,null,null,null,null,null,null,null,null,null,null,null,null,null,null,null,null,null,null,null,null,null,null,null,null,null,null,null,null,null,null,null,null,null,null,null,null,null,"","",null,null,null,"","",null,null,null,"","",null,null,null,"","",null,null,null,"","",null,null,null,"","",null,null,null,"","",null,null,null,"","",null,null,null,"","",null,null,null,"","",null,null,null,"","",null,null,null,"","",null,null,"","",null,null,"","",null,null,"","",null,null,"","",null,null,"","",null,null,"","",null,null,"","",null,null,"","",null,null,"","",null,null,"","",null,null,"","",null,null,"","",null,null,"","",null,null,"","",null,null,"","",null,null,"","",null,"",null,null,null,null,null,"",null,null,null,null,null,"",null,null,null,"",null,null,null,""]
[null,null,null,null,null,null,null,null,null,null,null,null,null,null,null,null,null,null,null,null,null,null,null,null,null,null,null,null,null,null,null,null,null,null,null,null,null,null,null,null,null,null,null,null,null,null,null,null,null,null,null,null,"","",null,null,null,"","",null,null,null,"","",null,null,null,"","",null,null,null,"","",null,null,null,"","",null,null,null,"","",null,null,null,"","",null,null,null,"","",null,null,null,"","",null,null,null,"","",null,null,null,"","",null,null,"","",null,null,"","",null,null,"","",null,null,"","",null,null,"","",null,null,"","",null,null,"","",null,null,"","",null,null,"","",null,null,"","",null,null,"","",null,null,"","",null,null,"","",null,null,"","",null,null,"","",null,null,"","",null,"",null,null,null,null,null,"",null,null,null,null,null,"",null,null,null,"",null,null,null,""]
[null,null,null,null,null,null,null,null,null,null,null,null,null,null,null,null,null,null,null,null,null,null,null,null,null,null,null,null,null,null,null,null,null,null,null,null,null,null,null,null,null,null,null,null,null,null,null,null,null,null,null,null,"","",null,null,null,"","",null,null,null,"","",null,null,null,"","",null,null,null,"","",null,null,null,"","",null,null,null,"","",null,null,null,"","",null,null,null,"","",null,null,null,"","",null,null,null,"","",null,null,null,"","",null,null,"","",null,null,"","",null,null,"","",null,null,"","",null,null,"","",null,null,"","",null,null,"","",null,null,"","",null,null,"","",null,null,"","",null,null,"","",null,null,"","",null,null,"","",null,null,"","",null,null,"","",null,null,"","",null,"",null,null,null,null,null,"",null,null,null,null,null,"",null,null,null,"",null,null,null,""]
[null,null,null,null,null,null,null,null,null,null,null,null,null,null,null,null,null,null,null,null,null,null,null,null,null,null,null,null,null,null,null,null,null,null,null,null,null,null,null,null,null,null,null,null,null,null,null,null,null,null,null,null,"","",null,null,null,"","",null,null,null,"","",null,null,null,"","",null,null,null,"","",null,null,null,"","",null,null,null,"","",null,null,null,"","",null,null,null,"","",null,null,null,"","",null,null,null,"","",null,null,null,"","",null,null,"","",null,null,"","",null,null,"","",null,null,"","",null,null,"","",null,null,"","",null,null,"","",null,null,"","",null,null,"","",null,null,"","",null,null,"","",null,null,"","",null,null,"","",null,null,"","",null,null,"","",null,null,"","",null,"",null,null,null,null,null,"",null,null,null,null,null,"",null,null,null,"",null,null,null,""]
[null,null,null,null,null,null,null,null,null,null,null,null,null,null,null,null,null,null,null,null,null,null,null,null,null,null,null,null,null,null,null,null,null,null,null,null,null,null,null,null,null,null,null,null,null,null,null,null,null,null,null,null,"","",null,null,null,"","",null,null,null,"","",null,null,null,"","",null,null,null,"","",null,null,null,"","",null,null,null,"","",null,null,null,"","",null,null,null,"","",null,null,null,"","",null,null,null,"","",null,null,null,"","",null,null,"","",null,null,"","",null,null,"","",null,null,"","",null,null,"","",null,null,"","",null,null,"","",null,null,"","",null,null,"","",null,null,"","",null,null,"","",null,null,"","",null,null,"","",null,null,"","",null,null,"","",null,null,"","",null,"",null,null,null,null,null,"",null,null,null,null,null,"",null,null,null,"",null,null,null,""]
[null,null,null,null,null,null,null,null,null,null,null,null,null,null,null,null,null,null,null,null,null,null,null,null,null,null,null,null,null,null,null,null,null,null,null,null,null,null,null,null,null,null,null,null,null,null,null,null,null,null,null,null,"","",null,null,null,"","",null,null,null,"","",null,null,null,"","",null,null,null,"","",null,null,null,"","",null,null,null,"","",null,null,null,"","",null,null,null,"","",null,null,null,"","",null,null,null,"","",null,null,null,"","",null,null,"","",null,null,"","",null,null,"","",null,null,"","",null,null,"","",null,null,"","",null,null,"","",null,null,"","",null,null,"","",null,null,"","",null,null,"","",null,null,"","",null,null,"","",null,null,"","",null,null,"","",null,null,"","",null,"",null,null,null,null,null,"",null,null,null,null,null,"",null,null,null,"",null,null,null,""]
[null,null,null,null,null,null,null,null,null,null,null,null,null,null,null,null,null,null,null,null,null,null,null,null,null,null,null,null,null,null,null,null,null,null,null,null,null,null,null,null,null,null,null,null,null,null,null,null,null,null,null,null,"","",null,null,null,"","",null,null,null,"","",null,null,null,"","",null,null,null,"","",null,null,null,"","",null,null,null,"","",null,null,null,"","",null,null,null,"","",null,null,null,"","",null,null,null,"","",null,null,null,"","",null,null,"","",null,null,"","",null,null,"","",null,null,"","",null,null,"","",null,null,"","",null,null,"","",null,null,"","",null,null,"","",null,null,"","",null,null,"","",null,null,"","",null,null,"","",null,null,"","",null,null,"","",null,null,"","",null,"",null,null,null,null,null,"",null,null,null,null,null,"",null,null,null,"",null,null,null,""]
[null,null,null,null,null,null,null,null,null,null,null,null,null,null,null,null,null,null,null,null,null,null,null,null,null,null,null,null,null,null,null,null,null,null,null,null,null,null,null,null,null,null,null,null,null,null,null,null,null,null,null,null,"","",null,null,null,"","",null,null,null,"","",null,null,null,"","",null,null,null,"","",null,null,null,"","",null,null,null,"","",null,null,null,"","",null,null,null,"","",null,null,null,"","",null,null,null,"","",null,null,null,"","",null,null,"","",null,null,"","",null,null,"","",null,null,"","",null,null,"","",null,null,"","",null,null,"","",null,null,"","",null,null,"","",null,null,"","",null,null,"","",null,null,"","",null,null,"","",null,null,"","",null,null,"","",null,null,"","",null,"",null,null,null,null,null,"",null,null,null,null,null,"",null,null,null,"",null,null,null,""]
[null,null,null,null,null,null,null,null,null,null,null,null,null,null,null,null,null,null,null,null,null,null,null,null,null,null,null,null,null,null,null,null,null,null,null,null,null,null,null,null,null,null,null,null,null,null,null,null,null,null,null,null,"","",null,null,null,"","",null,null,null,"","",null,null,null,"","",null,null,null,"","",null,null,null,"","",null,null,null,"","",null,null,null,"","",null,null,null,"","",null,null,null,"","",null,null,null,"","",null,null,null,"","",null,null,"","",null,null,"","",null,null,"","",null,null,"","",null,null,"","",null,null,"","",null,null,"","",null,null,"","",null,null,"","",null,null,"","",null,null,"","",null,null,"","",null,null,"","",null,null,"","",null,null,"","",null,null,"","",null,"",null,null,null,null,null,"",null,null,null,null,null,"",null,null,null,"",null,null,null,""]
[null,null,null,null,null,null,null,null,null,null,null,null,null,null,null,null,null,null,null,null,null,null,null,null,null,null,null,null,null,null,null,null,null,null,null,null,null,null,null,null,null,null,null,null,null,null,null,null,null,null,null,null,"","",null,null,null,"","",null,null,null,"","",null,null,null,"","",null,null,null,"","",null,null,null,"","",null,null,null,"","",null,null,null,"","",null,null,null,"","",null,null,null,"","",null,null,null,"","",null,null,null,"","",null,null,"","",null,null,"","",null,null,"","",null,null,"","",null,null,"","",null,null,"","",null,null,"","",null,null,"","",null,null,"","",null,null,"","",null,null,"","",null,null,"","",null,null,"","",null,null,"","",null,null,"","",null,null,"","",null,"",null,null,null,null,null,"",null,null,null,null,null,"",null,null,null,"",null,null,null,""]
[null,null,null,null,null,null,null,null,null,null,null,null,null,null,null,null,null,null,null,null,null,null,null,null,null,null,null,null,null,null,null,null,null,null,null,null,null,null,null,null,null,null,null,null,null,null,null,null,null,null,null,null,"","",null,null,null,"","",null,null,null,"","",null,null,null,"","",null,null,null,"","",null,null,null,"","",null,null,null,"","",null,null,null,"","",null,null,null,"","",null,null,null,"","",null,null,null,"","",null,null,null,"","",null,null,"","",null,null,"","",null,null,"","",null,null,"","",null,null,"","",null,null,"","",null,null,"","",null,null,"","",null,null,"","",null,null,"","",null,null,"","",null,null,"","",null,null,"","",null,null,"","",null,null,"","",null,null,"","",null,"",null,null,null,null,null,"",null,null,null,null,null,"",null,null,null,"",null,null,null,""]
[null,null,null,null,null,null,null,null,null,null,null,null,null,null,null,null,null,null,null,null,null,null,null,null,null,null,null,null,null,null,null,null,null,null,null,null,null,null,null,null,null,null,null,null,null,null,null,null,null,null,null,null,"","",null,null,null,"","",null,null,null,"","",null,null,null,"","",null,null,null,"","",null,null,null,"","",null,null,null,"","",null,null,null,"","",null,null,null,"","",null,null,null,"","",null,null,null,"","",null,null,null,"","",null,null,"","",null,null,"","",null,null,"","",null,null,"","",null,null,"","",null,null,"","",null,null,"","",null,null,"","",null,null,"","",null,null,"","",null,null,"","",null,null,"","",null,null,"","",null,null,"","",null,null,"","",null,null,"","",null,"",null,null,null,null,null,"",null,null,null,null,null,"",null,null,null,"",null,null,null,""]
[null,null,null,null,null,null,null,null,null,null,null,null,null,null,null,null,null,null,null,null,null,null,null,null,null,null,null,null,null,null,null,null,null,null,null,null,null,null,null,null,null,null,null,null,null,null,null,null,null,null,null,null,"","",null,null,null,"","",null,null,null,"","",null,null,null,"","",null,null,null,"","",null,null,null,"","",null,null,null,"","",null,null,null,"","",null,null,null,"","",null,null,null,"","",null,null,null,"","",null,null,null,"","",null,null,"","",null,null,"","",null,null,"","",null,null,"","",null,null,"","",null,null,"","",null,null,"","",null,null,"","",null,null,"","",null,null,"","",null,null,"","",null,null,"","",null,null,"","",null,null,"","",null,null,"","",null,null,"","",null,"",null,null,null,null,null,"",null,null,null,null,null,"",null,null,null,"",null,null,null,""]
[null,null,null,null,null,null,null,null,null,null,null,null,null,null,null,null,null,null,null,null,null,null,null,null,null,null,null,null,null,null,null,null,null,null,null,null,null,null,null,null,null,null,null,null,null,null,null,null,null,null,null,null,"","",null,null,null,"","",null,null,null,"","",null,null,null,"","",null,null,null,"","",null,null,null,"","",null,null,null,"","",null,null,null,"","",null,null,null,"","",null,null,null,"","",null,null,null,"","",null,null,null,"","",null,null,"","",null,null,"","",null,null,"","",null,null,"","",null,null,"","",null,null,"","",null,null,"","",null,null,"","",null,null,"","",null,null,"","",null,null,"","",null,null,"","",null,null,"","",null,null,"","",null,null,"","",null,null,"","",null,"",null,null,null,null,null,"",null,null,null,null,null,"",null,null,null,"",null,null,null,""]
[null,null,null,null,null,null,null,null,null,null,null,null,null,null,null,null,null,null,null,null,null,null,null,null,null,null,null,null,null,null,null,null,null,null,null,null,null,null,null,null,null,null,null,null,null,null,null,null,null,null,null,null,"","",null,null,null,"","",null,null,null,"","",null,null,null,"","",null,null,null,"","",null,null,null,"","",null,null,null,"","",null,null,null,"","",null,null,null,"","",null,null,null,"","",null,null,null,"","",null,null,null,"","",null,null,"","",null,null,"","",null,null,"","",null,null,"","",null,null,"","",null,null,"","",null,null,"","",null,null,"","",null,null,"","",null,null,"","",null,null,"","",null,null,"","",null,null,"","",null,null,"","",null,null,"","",null,null,"","",null,"",null,null,null,null,null,"",null,null,null,null,null,"",null,null,null,"",null,null,null,""]
[null,null,null,null,null,null,null,null,null,null,null,null,null,null,null,null,null,null,null,null,null,null,null,null,null,null,null,null,null,null,null,null,null,null,null,null,null,null,null,null,null,null,null,null,null,null,null,null,null,null,null,null,"","",null,null,null,"","",null,null,null,"","",null,null,null,"","",null,null,null,"","",null,null,null,"","",null,null,null,"","",null,null,null,"","",null,null,null,"","",null,null,null,"","",null,null,null,"","",null,null,null,"","",null,null,"","",null,null,"","",null,null,"","",null,null,"","",null,null,"","",null,null,"","",null,null,"","",null,null,"","",null,null,"","",null,null,"","",null,null,"","",null,null,"","",null,null,"","",null,null,"","",null,null,"","",null,null,"","",null,"",null,null,null,null,null,"",null,null,null,null,null,"",null,null,null,"",null,null,null,""]